[Box Backup-commit] [Failed Build] Box Backup [2984] Trunk

Trac trac at boxbackup.org
Sat Aug 27 15:56:40 BST 2011


Failed build of Box Backup [2984]
---------------------------------------------------------------------

  Changeset:             2984  -  <https://www.boxbackup.org/trac/changeset/2984>
  Committed by:          chris

  Build Configuration:   Trunk
  Build Platform:        CentOS 5 x86_64
  Build Slave:           bld-cent5
  Build Number:          1905  -  <https://www.boxbackup.org/trac/build/Trunk/1905>

  Failures:
    Step:                build-client
    Errors:              Executing make failed (error code 2)
    Log:
      [INFO    ] ==> Client build start
      [INFO    ] (cd bin/bbackupd; make RELEASE=1)
      [INFO    ] make[1]: Entering directory `bin/bbackupd'
      [INFO    ] make[2]: Entering directory `lib/win32'
      [INFO    ]   [CXX]     emu.cpp
      [INFO    ]   [CXX]     getopt_long.cpp
      [INFO    ]   [AR]      ../../release/lib/win32/win32.a
      [INFO    ]   [RANLIB]  ../../release/lib/win32/win32.a
      [INFO    ] make[2]: Leaving directory `lib/win32'
      [INFO    ] make[2]: Entering directory `lib/common'
      [INFO    ]   [CXX]     BoxException.cpp
      [INFO    ]   [CXX]     BoxTime.cpp
      [INFO    ]   [CXX]     BoxTimeToText.cpp
      [INFO    ]   [CXX]     BufferedStream.cpp
      [INFO    ]   [CXX]     BufferedWriteStream.cpp
      [INFO    ]   [CXX]     CollectInBufferStream.cpp
      [INFO    ]   [CXX]     Configuration.cpp
      [ERROR   ] Configuration.cpp: In member function ‘bool Configuration::Verify(const ConfigurationVerify&, const std::string&, std::string&)’:
      [ERROR   ] Configuration.cpp:721: warning: unused variable ‘r’
      [INFO    ]   [CXX]     ConversionString.cpp
      [INFO    ]   [CXX]     DebugAssertFailed.cpp
      [INFO    ]   [CXX]     DebugMemLeakFinder.cpp
      [INFO    ]   [CXX]     DebugPrintf.cpp
      [INFO    ]   [CXX]     EventWatchFilesystemObject.cpp
      [INFO    ]   [CXX]     ExcludeList.cpp
      [INFO    ]   [CXX]     FdGetLine.cpp
      [INFO    ]   [CXX]     FileModificationTime.cpp
      [INFO    ]   [CXX]     FileStream.cpp
      [INFO    ]   [CXX]     GetLine.cpp
      [INFO    ]   [CXX]     IOStream.cpp
      [INFO    ]   [CXX]     IOStreamGetLine.cpp
      [INFO    ]   [CXX]     InvisibleTempFileStream.cpp
      [INFO    ]   [CXX]     Logging.cpp
      [INFO    ]   [CXX]     MemBlockStream.cpp
      [INFO    ]   [CXX]     NamedLock.cpp
      [INFO    ]   [CXX]     PartialReadStream.cpp
      [INFO    ]   [CXX]     PathUtils.cpp
      [INFO    ]   [CXX]     RateLimitingStream.cpp
      [INFO    ]   [CXX]     ReadGatherStream.cpp
      [INFO    ]   [CXX]     ReadLoggingStream.cpp
      [INFO    ]   [CXX]     StreamableMemBlock.cpp
      [INFO    ]   [CXX]     Test.cpp
      [INFO    ]   [CXX]     Timer.cpp
      [ERROR   ] Timer.cpp: In static member function ‘static void Timers::Cleanup()’:
      [ERROR   ] Timer.cpp:86: warning: unused variable ‘result’
      [INFO    ]   [CXX]     UnixUser.cpp
      [INFO    ]   [CXX]     Utils.cpp
      [INFO    ]   [CXX]     WaitForEvent.cpp
      [INFO    ]   [CXX]     ZeroStream.cpp
      [INFO    ]   [CXX]     autogen_CommonException.cpp
      [INFO    ]   [CXX]     autogen_ConversionException.cpp
      [INFO    ]   [AR]      ../../release/lib/common/common.a
      [INFO    ]   [RANLIB]  ../../release/lib/common/common.a
      [INFO    ] make[2]: Leaving directory `lib/common'
      [INFO    ] make[2]: Entering directory `qdbm'
      [INFO    ] gcc -c -I. -I/usr/local/include -I/home/jamesog/include -I/usr/local/include -D_XOPEN_SOURCE_EXTENDED=1 -D_GNU_SOURCE=1 -D__EXTENSIONS__=1 -D_HPUX_SOURCE=1 -D_POSIX_MAPPED_FILES=1 -D_POSIX_SYNCHRONIZED_IO=1 -DPIC=1 -D_THREAD_SAFE=1 -D_REENTRANT=1 -DNDEBUG -g -O2 -Wall -pedantic -fPIC -fsigned-char -O0 -fforce-addr -minline-all-stringops depot.c
      [INFO    ] gcc -c -I. -I/usr/local/include -I/home/jamesog/include -I/usr/local/include -D_XOPEN_SOURCE_EXTENDED=1 -D_GNU_SOURCE=1 -D__EXTENSIONS__=1 -D_HPUX_SOURCE=1 -D_POSIX_MAPPED_FILES=1 -D_POSIX_SYNCHRONIZED_IO=1 -DPIC=1 -D_THREAD_SAFE=1 -D_REENTRANT=1 -DNDEBUG -g -O2 -Wall -pedantic -fPIC -fsigned-char -O0 -fforce-addr -minline-all-stringops curia.c
      [INFO    ] gcc -c -I. -I/usr/local/include -I/home/jamesog/include -I/usr/local/include -D_XOPEN_SOURCE_EXTENDED=1 -D_GNU_SOURCE=1 -D__EXTENSIONS__=1 -D_HPUX_SOURCE=1 -D_POSIX_MAPPED_FILES=1 -D_POSIX_SYNCHRONIZED_IO=1 -DPIC=1 -D_THREAD_SAFE=1 -D_REENTRANT=1 -DNDEBUG -g -O2 -Wall -pedantic -fPIC -fsigned-char -O0 -fforce-addr -minline-all-stringops relic.c
      [INFO    ] gcc -c -I. -I/usr/local/include -I/home/jamesog/include -I/usr/local/include -D_XOPEN_SOURCE_EXTENDED=1 -D_GNU_SOURCE=1 -D__EXTENSIONS__=1 -D_HPUX_SOURCE=1 -D_POSIX_MAPPED_FILES=1 -D_POSIX_SYNCHRONIZED_IO=1 -DPIC=1 -D_THREAD_SAFE=1 -D_REENTRANT=1 -DNDEBUG -g -O2 -Wall -pedantic -fPIC -fsigned-char -O0 -fforce-addr -minline-all-stringops hovel.c
      [INFO    ] gcc -c -I. -I/usr/local/include -I/home/jamesog/include -I/usr/local/include -D_XOPEN_SOURCE_EXTENDED=1 -D_GNU_SOURCE=1 -D__EXTENSIONS__=1 -D_HPUX_SOURCE=1 -D_POSIX_MAPPED_FILES=1 -D_POSIX_SYNCHRONIZED_IO=1 -DPIC=1 -D_THREAD_SAFE=1 -D_REENTRANT=1 -DNDEBUG -g -O2 -Wall -pedantic -fPIC -fsigned-char -O0 -fforce-addr -minline-all-stringops cabin.c
      [INFO    ] gcc -c -I. -I/usr/local/include -I/home/jamesog/include -I/usr/local/include -D_XOPEN_SOURCE_EXTENDED=1 -D_GNU_SOURCE=1 -D__EXTENSIONS__=1 -D_HPUX_SOURCE=1 -D_POSIX_MAPPED_FILES=1 -D_POSIX_SYNCHRONIZED_IO=1 -DPIC=1 -D_THREAD_SAFE=1 -D_REENTRANT=1 -DNDEBUG -g -O2 -Wall -pedantic -fPIC -fsigned-char -O0 -fforce-addr -minline-all-stringops villa.c
      [INFO    ] gcc -c -I. -I/usr/local/include -I/home/jamesog/include -I/usr/local/include -D_XOPEN_SOURCE_EXTENDED=1 -D_GNU_SOURCE=1 -D__EXTENSIONS__=1 -D_HPUX_SOURCE=1 -D_POSIX_MAPPED_FILES=1 -D_POSIX_SYNCHRONIZED_IO=1 -DPIC=1 -D_THREAD_SAFE=1 -D_REENTRANT=1 -DNDEBUG -g -O2 -Wall -pedantic -fPIC -fsigned-char -O0 -fforce-addr -minline-all-stringops vista.c
      [INFO    ] gcc -c -I. -I/usr/local/include -I/home/jamesog/include -I/usr/local/include -D_XOPEN_SOURCE_EXTENDED=1 -D_GNU_SOURCE=1 -D__EXTENSIONS__=1 -D_HPUX_SOURCE=1 -D_POSIX_MAPPED_FILES=1 -D_POSIX_SYNCHRONIZED_IO=1 -DPIC=1 -D_THREAD_SAFE=1 -D_REENTRANT=1 -DNDEBUG -g -O2 -Wall -pedantic -fPIC -fsigned-char -O0 -fforce-addr -minline-all-stringops odeum.c
      [INFO    ] gcc -c -I. -I/usr/local/include -I/home/jamesog/include -I/usr/local/include -D_XOPEN_SOURCE_EXTENDED=1 -D_GNU_SOURCE=1 -D__EXTENSIONS__=1 -D_HPUX_SOURCE=1 -D_POSIX_MAPPED_FILES=1 -D_POSIX_SYNCHRONIZED_IO=1 -DPIC=1 -D_THREAD_SAFE=1 -D_REENTRANT=1 -DNDEBUG -g -O2 -Wall -pedantic -fPIC -fsigned-char -O0 -fforce-addr -minline-all-stringops myconf.c
      [INFO    ] /usr/bin/ar rcsv libqdbm.a depot.o curia.o relic.o hovel.o cabin.o villa.o vista.o odeum.o myconf.o
      [INFO    ] a - depot.o
      [INFO    ] a - curia.o
      [INFO    ] a - relic.o
      [INFO    ] a - hovel.o
      [INFO    ] a - cabin.o
      [INFO    ] a - villa.o
      [INFO    ] a - vista.o
      [INFO    ] a - odeum.o
      [INFO    ] a - myconf.o
      [INFO    ] make[2]: Leaving directory `qdbm'
      [INFO    ] make[2]: Entering directory `lib/compress'
      [INFO    ]   [CXX]     CompressStream.cpp
      [INFO    ]   [CXX]     autogen_CompressException.cpp
      [INFO    ]   [AR]      ../../release/lib/compress/compress.a
      [INFO    ]   [RANLIB]  ../../release/lib/compress/compress.a
      [INFO    ] make[2]: Leaving directory `lib/compress'
      [INFO    ] make[2]: Entering directory `lib/crypto'
      [INFO    ]   [CXX]     CipherAES.cpp
      [INFO    ]   [CXX]     CipherBlowfish.cpp
      [INFO    ]   [CXX]     CipherContext.cpp
      [INFO    ]   [CXX]     CipherDescription.cpp
      [INFO    ]   [CXX]     MD5Digest.cpp
      [INFO    ]   [CXX]     Random.cpp
      [INFO    ]   [CXX]     RollingChecksum.cpp
      [INFO    ]   [CXX]     autogen_CipherException.cpp
      [INFO    ]   [AR]      ../../release/lib/crypto/crypto.a
      [INFO    ]   [RANLIB]  ../../release/lib/crypto/crypto.a
      [INFO    ] make[2]: Leaving directory `lib/crypto'
      [INFO    ] make[2]: Entering directory `lib/raidfile'
      [INFO    ]   [CXX]     RaidFileController.cpp
      [INFO    ]   [CXX]     RaidFileRead.cpp
      [INFO    ]   [CXX]     RaidFileUtil.cpp
      [INFO    ]   [CXX]     RaidFileWrite.cpp
      [INFO    ]   [CXX]     autogen_RaidFileException.cpp
      [INFO    ]   [AR]      ../../release/lib/raidfile/raidfile.a
      [INFO    ]   [RANLIB]  ../../release/lib/raidfile/raidfile.a
      [INFO    ] make[2]: Leaving directory `lib/raidfile'
      [INFO    ] make[2]: Entering directory `lib/server'
      [INFO    ]   [CXX]     Daemon.cpp
      [INFO    ]   [CXX]     LocalProcessStream.cpp
      [INFO    ]   [CXX]     Message.cpp
      [INFO    ]   [CXX]     Protocol.cpp
      [INFO    ]   [CXX]     ProtocolUncertainStream.cpp
      [INFO    ]   [CXX]     SSLLib.cpp
      [INFO    ]   [CXX]     ServerControl.cpp
      [INFO    ]   [CXX]     Socket.cpp
      [INFO    ]   [CXX]     SocketStream.cpp
      [INFO    ]   [CXX]     SocketStreamTLS.cpp
      [INFO    ]   [CXX]     TLSContext.cpp
      [INFO    ]   [CXX]     WinNamedPipeStream.cpp
      [INFO    ]   [CXX]     autogen_ConnectionException.cpp
      [INFO    ]   [CXX]     autogen_ServerException.cpp
      [INFO    ]   [AR]      ../../release/lib/server/server.a
      [INFO    ]   [RANLIB]  ../../release/lib/server/server.a
      [INFO    ] make[2]: Leaving directory `lib/server'
      [INFO    ] make[2]: Entering directory `lib/backupstore'
      [INFO    ]   [CXX]     BackupClientFileAttributes.cpp
      [INFO    ]   [CXX]     BackupCommands.cpp
      [ERROR   ] BackupCommands.cpp:58: error: ‘BackupProtocolVersion’ has not been declared
      [ERROR   ] BackupCommands.cpp:58: error: non-member function ‘std::auto_ptr<BackupProtocolMessage> DoCommand(BackupProtocolReplyable&, BackupStoreContext&)’ cannot have cv-qualifier
      [ERROR   ] BackupCommands.cpp: In function ‘std::auto_ptr<BackupProtocolMessage> DoCommand(BackupProtocolReplyable&, BackupStoreContext&)’:
      [ERROR   ] BackupCommands.cpp:60: error: no matching function for call to ‘std::auto_ptr<BackupProtocolMessage>::auto_ptr(int*)’
      [ERROR   ] /usr/lib/gcc/x86_64-redhat-linux/4.1.2/../../../../include/c++/4.1.2/memory:349: note: candidates are: std::auto_ptr<_Tp>::auto_ptr(std::auto_ptr_ref<_Tp>) [with _Tp = BackupProtocolMessage]
      [ERROR   ] /usr/lib/gcc/x86_64-redhat-linux/4.1.2/../../../../include/c++/4.1.2/memory:199: note:                 std::auto_ptr<_Tp>::auto_ptr(std::auto_ptr<_Tp>&) [with _Tp = BackupProtocolMessage]
      [ERROR   ] /usr/lib/gcc/x86_64-redhat-linux/4.1.2/../../../../include/c++/4.1.2/memory:190: note:                 std::auto_ptr<_Tp>::auto_ptr(_Tp*) [with _Tp = BackupProtocolMessage]
      [ERROR   ] BackupCommands.cpp:60: error: expected primary-expression before ‘(’ token
      [ERROR   ] BackupCommands.cpp:60: error: expected type-specifier before ‘BackupProtocolError’
      [ERROR   ] BackupCommands.cpp:60: error: expected `)' before ‘BackupProtocolError’
      [ERROR   ] BackupCommands.cpp:63: error: ‘mVersion’ was not declared in this scope
      [ERROR   ] BackupCommands.cpp:65: error: no matching function for call to ‘std::auto_ptr<BackupProtocolMessage>::auto_ptr(int*)’
      [ERROR   ] /usr/lib/gcc/x86_64-redhat-linux/4.1.2/../../../../include/c++/4.1.2/memory:349: note: candidates are: std::auto_ptr<_Tp>::auto_ptr(std::auto_ptr_ref<_Tp>) [with _Tp = BackupProtocolMessage]
      [ERROR   ] /usr/lib/gcc/x86_64-redhat-linux/4.1.2/../../../../include/c++/4.1.2/memory:199: note:                 std::auto_ptr<_Tp>::auto_ptr(std::auto_ptr<_Tp>&) [with _Tp = BackupProtocolMessage]
      [ERROR   ] /usr/lib/gcc/x86_64-redhat-linux/4.1.2/../../../../include/c++/4.1.2/memory:190: note:                 std::auto_ptr<_Tp>::auto_ptr(_Tp*) [with _Tp = BackupProtocolMessage]
      [ERROR   ] BackupCommands.cpp:65: error: expected primary-expression before ‘(’ token
      [ERROR   ] BackupCommands.cpp:65: error: expected type-specifier before ‘BackupProtocolError’
      [ERROR   ] BackupCommands.cpp:65: error: expected `)' before ‘BackupProtocolError’
      [ERROR   ] BackupCommands.cpp:72: error: no matching function for call to ‘std::auto_ptr<BackupProtocolMessage>::auto_ptr(int*)’
      [ERROR   ] /usr/lib/gcc/x86_64-redhat-linux/4.1.2/../../../../include/c++/4.1.2/memory:349: note: candidates are: std::auto_ptr<_Tp>::auto_ptr(std::auto_ptr_ref<_Tp>) [with _Tp = BackupProtocolMessage]
      [ERROR   ] /usr/lib/gcc/x86_64-redhat-linux/4.1.2/../../../../include/c++/4.1.2/memory:199: note:                 std::auto_ptr<_Tp>::auto_ptr(std::auto_ptr<_Tp>&) [with _Tp = BackupProtocolMessage]
      [ERROR   ] /usr/lib/gcc/x86_64-redhat-linux/4.1.2/../../../../include/c++/4.1.2/memory:190: note:                 std::auto_ptr<_Tp>::auto_ptr(_Tp*) [with _Tp = BackupProtocolMessage]
      [ERROR   ] BackupCommands.cpp:72: error: expected primary-expression before ‘(’ token
      [ERROR   ] BackupCommands.cpp:72: error: expected type-specifier before ‘BackupProtocolVersion’
      [ERROR   ] BackupCommands.cpp:72: error: expected `)' before ‘BackupProtocolVersion’
      [ERROR   ] BackupCommands.cpp: At global scope:
      [ERROR   ] BackupCommands.cpp:83: error: ‘BackupProtocolLogin’ has not been declared
      [ERROR   ] BackupCommands.cpp:83: error: non-member function ‘std::auto_ptr<BackupProtocolMessage> DoCommand(BackupProtocolReplyable&, BackupStoreContext&)’ cannot have cv-qualifier
      [ERROR   ] BackupCommands.cpp: In function ‘std::auto_ptr<BackupProtocolMessage> DoCommand(BackupProtocolReplyable&, BackupStoreContext&)’:
      [ERROR   ] BackupCommands.cpp:83: error: redefinition of ‘std::auto_ptr<BackupProtocolMessage> DoCommand(BackupProtocolReplyable&, BackupStoreContext&)’
      [ERROR   ] BackupCommands.cpp:58: error: ‘std::auto_ptr<BackupProtocolMessage> DoCommand(BackupProtocolReplyable&, BackupStoreContext&)’ previously defined here
      [ERROR   ] BackupCommands.cpp:85: error: no matching function for call to ‘std::auto_ptr<BackupProtocolMessage>::auto_ptr(int*)’
      [ERROR   ] /usr/lib/gcc/x86_64-redhat-linux/4.1.2/../../../../include/c++/4.1.2/memory:349: note: candidates are: std::auto_ptr<_Tp>::auto_ptr(std::auto_ptr_ref<_Tp>) [with _Tp = BackupProtocolMessage]
      [ERROR   ] /usr/lib/gcc/x86_64-redhat-linux/4.1.2/../../../../include/c++/4.1.2/memory:199: note:                 std::auto_ptr<_Tp>::auto_ptr(std::auto_ptr<_Tp>&) [with _Tp = BackupProtocolMessage]
      [ERROR   ] /usr/lib/gcc/x86_64-redhat-linux/4.1.2/../../../../include/c++/4.1.2/memory:190: note:                 std::auto_ptr<_Tp>::auto_ptr(_Tp*) [with _Tp = BackupProtocolMessage]
      [ERROR   ] BackupCommands.cpp:85: error: expected primary-expression before ‘(’ token
      [ERROR   ] BackupCommands.cpp:85: error: expected type-specifier before ‘BackupProtocolError’
      [ERROR   ] BackupCommands.cpp:85: error: expected `)' before ‘BackupProtocolError’
      [ERROR   ] BackupCommands.cpp:89: error: ‘mClientID’ was not declared in this scope
      [ERROR   ] BackupCommands.cpp:94: error: no matching function for call to ‘std::auto_ptr<BackupProtocolMessage>::auto_ptr(int*)’
      [ERROR   ] /usr/lib/gcc/x86_64-redhat-linux/4.1.2/../../../../include/c++/4.1.2/memory:349: note: candidates are: std::auto_ptr<_Tp>::auto_ptr(std::auto_ptr_ref<_Tp>) [with _Tp = BackupProtocolMessage]
      [ERROR   ] /usr/lib/gcc/x86_64-redhat-linux/4.1.2/../../../../include/c++/4.1.2/memory:199: note:                 std::auto_ptr<_Tp>::auto_ptr(std::auto_ptr<_Tp>&) [with _Tp = BackupProtocolMessage]
      [ERROR   ] /usr/lib/gcc/x86_64-redhat-linux/4.1.2/../../../../include/c++/4.1.2/memory:190: note:                 std::auto_ptr<_Tp>::auto_ptr(_Tp*) [with _Tp = BackupProtocolMessage]
      [ERROR   ] BackupCommands.cpp:94: error: expected primary-expression before ‘(’ token
      [ERROR   ] BackupCommands.cpp:94: error: expected type-specifier before ‘BackupProtocolError’
      [ERROR   ] BackupCommands.cpp:94: error: expected `)' before ‘BackupProtocolError’
      [ERROR   ] BackupCommands.cpp:99: error: ‘mClientID’ was not declared in this scope
      [ERROR   ] BackupCommands.cpp:102: error: no matching function for call to ‘std::auto_ptr<BackupProtocolMessage>::auto_ptr(int*)’
      [ERROR   ] /usr/lib/gcc/x86_64-redhat-linux/4.1.2/../../../../include/c++/4.1.2/memory:349: note: candidates are: std::auto_ptr<_Tp>::auto_ptr(std::auto_ptr_ref<_Tp>) [with _Tp = BackupProtocolMessage]
      [ERROR   ] /usr/lib/gcc/x86_64-redhat-linux/4.1.2/../../../../include/c++/4.1.2/memory:199: note:                 std::auto_ptr<_Tp>::auto_ptr(std::auto_ptr<_Tp>&) [with _Tp = BackupProtocolMessage]
      [ERROR   ] /usr/lib/gcc/x86_64-redhat-linux/4.1.2/../../../../include/c++/4.1.2/memory:190: note:                 std::auto_ptr<_Tp>::auto_ptr(_Tp*) [with _Tp = BackupProtocolMessage]
      [ERROR   ] BackupCommands.cpp:102: error: expected primary-expression before ‘(’ token
      [ERROR   ] BackupCommands.cpp:102: error: expected type-specifier before ‘BackupProtocolError’
      [ERROR   ] BackupCommands.cpp:102: error: expected `)' before ‘BackupProtocolError’
      [ERROR   ] BackupCommands.cpp:106: error: ‘mFlags’ was not declared in this scope
      [ERROR   ] BackupCommands.cpp:106: error: ‘Flags_ReadOnly’ was not declared in this scope
      [ERROR   ] BackupCommands.cpp:111: error: ‘mClientID’ was not declared in this scope
      [ERROR   ] BackupCommands.cpp:113: error: no matching function for call to ‘std::auto_ptr<BackupProtocolMessage>::auto_ptr(int*)’
      [ERROR   ] /usr/lib/gcc/x86_64-redhat-linux/4.1.2/../../../../include/c++/4.1.2/memory:349: note: candidates are: std::auto_ptr<_Tp>::auto_ptr(std::auto_ptr_ref<_Tp>) [with _Tp = BackupProtocolMessage]
      [ERROR   ] /usr/lib/gcc/x86_64-redhat-linux/4.1.2/../../../../include/c++/4.1.2/memory:199: note:                 std::auto_ptr<_Tp>::auto_ptr(std::auto_ptr<_Tp>&) [with _Tp = BackupProtocolMessage]
      [ERROR   ] /usr/lib/gcc/x86_64-redhat-linux/4.1.2/../../../../include/c++/4.1.2/memory:190: note:                 std::auto_ptr<_Tp>::auto_ptr(_Tp*) [with _Tp = BackupProtocolMessage]
      [ERROR   ] BackupCommands.cpp:113: error: expected primary-expression before ‘(’ token
      [ERROR   ] BackupCommands.cpp:113: error: expected type-specifier before ‘BackupProtocolError’
      [ERROR   ] BackupCommands.cpp:113: error: expected `)' before ‘BackupProtocolError’
      [ERROR   ] BackupCommands.cpp:130: error: ‘mClientID’ was not declared in this scope
      [ERROR   ] BackupCommands.cpp:130: error: ‘mFlags’ was not declared in this scope
      [ERROR   ] BackupCommands.cpp:130: error: ‘Flags_ReadOnly’ was not declared in this scope
      [ERROR   ] BackupCommands.cpp:141: error: no matching function for call to ‘std::auto_ptr<BackupProtocolMessage>::auto_ptr(int*)’
      [ERROR   ] /usr/lib/gcc/x86_64-redhat-linux/4.1.2/../../../../include/c++/4.1.2/memory:349: note: candidates are: std::auto_ptr<_Tp>::auto_ptr(std::auto_ptr_ref<_Tp>) [with _Tp = BackupProtocolMessage]
      [ERROR   ] /usr/lib/gcc/x86_64-redhat-linux/4.1.2/../../../../include/c++/4.1.2/memory:199: note:                 std::auto_ptr<_Tp>::auto_ptr(std::auto_ptr<_Tp>&) [with _Tp = BackupProtocolMessage]
      [ERROR   ] /usr/lib/gcc/x86_64-redhat-linux/4.1.2/../../../../include/c++/4.1.2/memory:190: note:                 std::auto_ptr<_Tp>::auto_ptr(_Tp*) [with _Tp = BackupProtocolMessage]
      [ERROR   ] BackupCommands.cpp:141: error: expected primary-expression before ‘(’ token
      [ERROR   ] BackupCommands.cpp:141: error: expected type-specifier before ‘BackupProtocolLoginConfirmed’
      [ERROR   ] BackupCommands.cpp:141: error: expected `)' before ‘BackupProtocolLoginConfirmed’
      [ERROR   ] BackupCommands.cpp:124: warning: unused variable ‘clientStoreMarker’
      [ERROR   ] BackupCommands.cpp: At global scope:
      [ERROR   ] BackupCommands.cpp:152: error: ‘BackupProtocolFinished’ has not been declared
      [ERROR   ] BackupCommands.cpp:152: error: non-member function ‘std::auto_ptr<BackupProtocolMessage> DoCommand(BackupProtocolReplyable&, BackupStoreContext&)’ cannot have cv-qualifier
      [ERROR   ] BackupCommands.cpp: In function ‘std::auto_ptr<BackupProtocolMessage> DoCommand(BackupProtocolReplyable&, BackupStoreContext&)’:
      [ERROR   ] BackupCommands.cpp:152: error: redefinition of ‘std::auto_ptr<BackupProtocolMessage> DoCommand(BackupProtocolReplyable&, BackupStoreContext&)’
      [ERROR   ] BackupCommands.cpp:58: error: ‘std::auto_ptr<BackupProtocolMessage> DoCommand(BackupProtocolReplyable&, BackupStoreContext&)’ previously defined here
      [ERROR   ] BackupCommands.cpp:161: error: no matching function for call to ‘std::auto_ptr<BackupProtocolMessage>::auto_ptr(int*)’
      [ERROR   ] /usr/lib/gcc/x86_64-redhat-linux/4.1.2/../../../../include/c++/4.1.2/memory:349: note: candidates are: std::auto_ptr<_Tp>::auto_ptr(std::auto_ptr_ref<_Tp>) [with _Tp = BackupProtocolMessage]
      [ERROR   ] /usr/lib/gcc/x86_64-redhat-linux/4.1.2/../../../../include/c++/4.1.2/memory:199: note:                 std::auto_ptr<_Tp>::auto_ptr(std::auto_ptr<_Tp>&) [with _Tp = BackupProtocolMessage]
      [ERROR   ] /usr/lib/gcc/x86_64-redhat-linux/4.1.2/../../../../include/c++/4.1.2/memory:190: note:                 std::auto_ptr<_Tp>::auto_ptr(_Tp*) [with _Tp = BackupProtocolMessage]
      [ERROR   ] BackupCommands.cpp:161: error: expected primary-expression before ‘(’ token
      [ERROR   ] BackupCommands.cpp:161: error: expected type-specifier before ‘BackupProtocolFinished’
      [ERROR   ] BackupCommands.cpp:161: error: expected `)' before ‘BackupProtocolFinished’
      [ERROR   ] BackupCommands.cpp: At global scope:
      [ERROR   ] BackupCommands.cpp:173: error: ‘BackupProtocolListDirectory’ has not been declared
      [ERROR   ] BackupCommands.cpp:173: error: non-member function ‘std::auto_ptr<BackupProtocolMessage> DoCommand(BackupProtocolReplyable&, BackupStoreContext&)’ cannot have cv-qualifier
      [ERROR   ] BackupCommands.cpp: In function ‘std::auto_ptr<BackupProtocolMessage> DoCommand(BackupProtocolReplyable&, BackupStoreContext&)’:
      [ERROR   ] BackupCommands.cpp:173: error: redefinition of ‘std::auto_ptr<BackupProtocolMessage> DoCommand(BackupProtocolReplyable&, BackupStoreContext&)’
      [ERROR   ] BackupCommands.cpp:58: error: ‘std::auto_ptr<BackupProtocolMessage> DoCommand(BackupProtocolReplyable&, BackupStoreContext&)’ previously defined here
      [ERROR   ] BackupCommands.cpp:175: error: no matching function for call to ‘std::auto_ptr<BackupProtocolMessage>::auto_ptr(int*)’
      [ERROR   ] /usr/lib/gcc/x86_64-redhat-linux/4.1.2/../../../../include/c++/4.1.2/memory:349: note: candidates are: std::auto_ptr<_Tp>::auto_ptr(std::auto_ptr_ref<_Tp>) [with _Tp = BackupProtocolMessage]
      [ERROR   ] /usr/lib/gcc/x86_64-redhat-linux/4.1.2/../../../../include/c++/4.1.2/memory:199: note:                 std::auto_ptr<_Tp>::auto_ptr(std::auto_ptr<_Tp>&) [with _Tp = BackupProtocolMessage]
      [ERROR   ] /usr/lib/gcc/x86_64-redhat-linux/4.1.2/../../../../include/c++/4.1.2/memory:190: note:                 std::auto_ptr<_Tp>::auto_ptr(_Tp*) [with _Tp = BackupProtocolMessage]
      [ERROR   ] BackupCommands.cpp:175: error: expected primary-expression before ‘(’ token
      [ERROR   ] BackupCommands.cpp:175: error: expected type-specifier before ‘BackupProtocolError’
      [ERROR   ] BackupCommands.cpp:175: error: expected `)' before ‘BackupProtocolError’
      [ERROR   ] BackupCommands.cpp:184: error: ‘mObjectID’ was not declared in this scope
      [ERROR   ] BackupCommands.cpp:185: error: ‘mFlagsMustBeSet’ was not declared in this scope
      [ERROR   ] BackupCommands.cpp:186: error: ‘mFlagsNotToBeSet’ was not declared in this scope
      [ERROR   ] BackupCommands.cpp:186: error: ‘mSendAttributes’ was not declared in this scope
      [ERROR   ] BackupCommands.cpp:193: error: no matching function for call to ‘std::auto_ptr<BackupProtocolMessage>::auto_ptr(int*)’
      [ERROR   ] /usr/lib/gcc/x86_64-redhat-linux/4.1.2/../../../../include/c++/4.1.2/memory:349: note: candidates are: std::auto_ptr<_Tp>::auto_ptr(std::auto_ptr_ref<_Tp>) [with _Tp = BackupProtocolMessage]
      [ERROR   ] /usr/lib/gcc/x86_64-redhat-linux/4.1.2/../../../../include/c++/4.1.2/memory:199: note:                 std::auto_ptr<_Tp>::auto_ptr(std::auto_ptr<_Tp>&) [with _Tp = BackupProtocolMessage]
      [ERROR   ] /usr/lib/gcc/x86_64-redhat-linux/4.1.2/../../../../include/c++/4.1.2/memory:190: note:                 std::auto_ptr<_Tp>::auto_ptr(_Tp*) [with _Tp = BackupProtocolMessage]
      [ERROR   ] BackupCommands.cpp:193: error: expected primary-expression before ‘(’ token
      [ERROR   ] BackupCommands.cpp:193: error: expected type-specifier before ‘BackupProtocolError’
      [ERROR   ] BackupCommands.cpp:193: error: expected `)' before ‘BackupProtocolError’
      [ERROR   ] BackupCommands.cpp:204: error: no matching function for call to ‘std::auto_ptr<BackupProtocolMessage>::auto_ptr(int*)’
      [ERROR   ] /usr/lib/gcc/x86_64-redhat-linux/4.1.2/../../../../include/c++/4.1.2/memory:349: note: candidates are: std::auto_ptr<_Tp>::auto_ptr(std::auto_ptr_ref<_Tp>) [with _Tp = BackupProtocolMessage]
      [ERROR   ] /usr/lib/gcc/x86_64-redhat-linux/4.1.2/../../../../include/c++/4.1.2/memory:199: note:                 std::auto_ptr<_Tp>::auto_ptr(std::auto_ptr<_Tp>&) [with _Tp = BackupProtocolMessage]
      [ERROR   ] /usr/lib/gcc/x86_64-redhat-linux/4.1.2/../../../../include/c++/4.1.2/memory:190: note:                 std::auto_ptr<_Tp>::auto_ptr(_Tp*) [with _Tp = BackupProtocolMessage]
      [ERROR   ] BackupCommands.cpp:203: error: expected primary-expression before ‘(’ token
      [ERROR   ] BackupCommands.cpp:204: error: expected type-specifier before ‘BackupProtocolSuccess’
      [ERROR   ] BackupCommands.cpp:204: error: expected `)' before ‘BackupProtocolSuccess’
      [ERROR   ] BackupCommands.cpp: At global scope:
      [ERROR   ] BackupCommands.cpp:215: error: ‘BackupProtocolStoreFile’ has not been declared
      [ERROR   ] BackupCommands.cpp:215: error: non-member function ‘std::auto_ptr<BackupProtocolMessage> DoCommand(BackupProtocolReplyable&, BackupStoreContext&)’ cannot have cv-qualifier
      [ERROR   ] BackupCommands.cpp: In function ‘std::auto_ptr<BackupProtocolMessage> DoCommand(BackupProtocolReplyable&, BackupStoreContext&)’:
      [ERROR   ] BackupCommands.cpp:215: error: redefinition of ‘std::auto_ptr<BackupProtocolMessage> DoCommand(BackupProtocolReplyable&, BackupStoreContext&)’
      [ERROR   ] BackupCommands.cpp:58: error: ‘std::auto_ptr<BackupProtocolMessage> DoCommand(BackupProtocolReplyable&, BackupStoreContext&)’ previously defined here
      [ERROR   ] BackupCommands.cpp:217: error: no matching function for call to ‘std::auto_ptr<BackupProtocolMessage>::auto_ptr(int*)’
      [ERROR   ] /usr/lib/gcc/x86_64-redhat-linux/4.1.2/../../../../include/c++/4.1.2/memory:349: note: candidates are: std::auto_ptr<_Tp>::auto_ptr(std::auto_ptr_ref<_Tp>) [with _Tp = BackupProtocolMessage]
      [ERROR   ] /usr/lib/gcc/x86_64-redhat-linux/4.1.2/../../../../include/c++/4.1.2/memory:199: note:                 std::auto_ptr<_Tp>::auto_ptr(std::auto_ptr<_Tp>&) [with _Tp = BackupProtocolMessage]
      [ERROR   ] /usr/lib/gcc/x86_64-redhat-linux/4.1.2/../../../../include/c++/4.1.2/memory:190: note:                 std::auto_ptr<_Tp>::auto_ptr(_Tp*) [with _Tp = BackupProtocolMessage]
      [ERROR   ] BackupCommands.cpp:217: error: expected primary-expression before ‘(’ token
      [ERROR   ] BackupCommands.cpp:217: error: expected type-specifier before ‘BackupProtocolError’
      [ERROR   ] BackupCommands.cpp:217: error: expected `)' before ‘BackupProtocolError’
      [ERROR   ] BackupCommands.cpp:218: error: no matching function for call to ‘std::auto_ptr<BackupProtocolMessage>::auto_ptr(int*)’
      [ERROR   ] /usr/lib/gcc/x86_64-redhat-linux/4.1.2/../../../../include/c++/4.1.2/memory:349: note: candidates are: std::auto_ptr<_Tp>::auto_ptr(std::auto_ptr_ref<_Tp>) [with _Tp = BackupProtocolMessage]
      [ERROR   ] /usr/lib/gcc/x86_64-redhat-linux/4.1.2/../../../../include/c++/4.1.2/memory:199: note:                 std::auto_ptr<_Tp>::auto_ptr(std::auto_ptr<_Tp>&) [with _Tp = BackupProtocolMessage]
      [ERROR   ] /usr/lib/gcc/x86_64-redhat-linux/4.1.2/../../../../include/c++/4.1.2/memory:190: note:                 std::auto_ptr<_Tp>::auto_ptr(_Tp*) [with _Tp = BackupProtocolMessage]
      [ERROR   ] BackupCommands.cpp:218: error: expected primary-expression before ‘(’ token
      [ERROR   ] BackupCommands.cpp:218: error: expected type-specifier before ‘BackupProtocolError’
      [ERROR   ] BackupCommands.cpp:218: error: expected `)' before ‘BackupProtocolError’
      [ERROR   ] BackupCommands.cpp:221: error: invalid use of ‘this’ in non-member function
      [ERROR   ] BackupCommands.cpp:228: error: ‘mDiffFromFileID’ was not declared in this scope
      [ERROR   ] BackupCommands.cpp:233: error: no matching function for call to ‘std::auto_ptr<BackupProtocolMessage>::auto_ptr(int*)’
      [ERROR   ] /usr/lib/gcc/x86_64-redhat-linux/4.1.2/../../../../include/c++/4.1.2/memory:349: note: candidates are: std::auto_ptr<_Tp>::auto_ptr(std::auto_ptr_ref<_Tp>) [with _Tp = BackupProtocolMessage]
      [ERROR   ] /usr/lib/gcc/x86_64-redhat-linux/4.1.2/../../../../include/c++/4.1.2/memory:199: note:                 std::auto_ptr<_Tp>::auto_ptr(std::auto_ptr<_Tp>&) [with _Tp = BackupProtocolMessage]
      [ERROR   ] /usr/lib/gcc/x86_64-redhat-linux/4.1.2/../../../../include/c++/4.1.2/memory:190: note:                 std::auto_ptr<_Tp>::auto_ptr(_Tp*) [with _Tp = BackupProtocolMessage]
      [ERROR   ] BackupCommands.cpp:233: error: expected primary-expression before ‘(’ token
      [ERROR   ] BackupCommands.cpp:233: error: expected type-specifier before ‘BackupProtocolError’
      [ERROR   ] BackupCommands.cpp:233: error: expected `)' before ‘BackupProtocolError’
      [ERROR   ] BackupCommands.cpp:244: error: ‘mDirectoryObjectID’ was not declared in this scope
      [ERROR   ] BackupCommands.cpp:245: error: ‘mModificationTime’ was not declared in this scope
      [ERROR   ] BackupCommands.cpp:245: error: ‘mAttributesHash’ was not declared in this scope
      [ERROR   ] BackupCommands.cpp:245: error: ‘mDiffFromFileID’ was not declared in this scope
      [ERROR   ] BackupCommands.cpp:246: error: ‘mFilename’ was not declared in this scope
      [ERROR   ] BackupCommands.cpp:253: error: no matching function for call to ‘std::auto_ptr<BackupProtocolMessage>::auto_ptr(int*)’
      [ERROR   ] /usr/lib/gcc/x86_64-redhat-linux/4.1.2/../../../../include/c++/4.1.2/memory:349: note: candidates are: std::auto_ptr<_Tp>::auto_ptr(std::auto_ptr_ref<_Tp>) [with _Tp = BackupProtocolMessage]
      [ERROR   ] /usr/lib/gcc/x86_64-redhat-linux/4.1.2/../../../../include/c++/4.1.2/memory:199: note:                 std::auto_ptr<_Tp>::auto_ptr(std::auto_ptr<_Tp>&) [with _Tp = BackupProtocolMessage]
      [ERROR   ] /usr/lib/gcc/x86_64-redhat-linux/4.1.2/../../../../include/c++/4.1.2/memory:190: note:                 std::auto_ptr<_Tp>::auto_ptr(_Tp*) [with _Tp = BackupProtocolMessage]
      [ERROR   ] BackupCommands.cpp:253: error: expected primary-expression before ‘(’ token
      [ERROR   ] BackupCommands.cpp:253: error: expected type-specifier before ‘BackupProtocolError’
      [ERROR   ] BackupCommands.cpp:253: error: expected `)' before ‘BackupProtocolError’
      [ERROR   ] BackupCommands.cpp:257: error: no matching function for call to ‘std::auto_ptr<BackupProtocolMessage>::auto_ptr(int*)’
      [ERROR   ] /usr/lib/gcc/x86_64-redhat-linux/4.1.2/../../../../include/c++/4.1.2/memory:349: note: candidates are: std::auto_ptr<_Tp>::auto_ptr(std::auto_ptr_ref<_Tp>) [with _Tp = BackupProtocolMessage]
      [ERROR   ] /usr/lib/gcc/x86_64-redhat-linux/4.1.2/../../../../include/c++/4.1.2/memory:199: note:                 std::auto_ptr<_Tp>::auto_ptr(std::auto_ptr<_Tp>&) [with _Tp = BackupProtocolMessage]
      [ERROR   ] /usr/lib/gcc/x86_64-redhat-linux/4.1.2/../../../../include/c++/4.1.2/memory:190: note:                 std::auto_ptr<_Tp>::auto_ptr(_Tp*) [with _Tp = BackupProtocolMessage]
      [ERROR   ] BackupCommands.cpp:257: error: expected primary-expression before ‘(’ token
      [ERROR   ] BackupCommands.cpp:257: error: expected type-specifier before ‘BackupProtocolError’
      [ERROR   ] BackupCommands.cpp:257: error: expected `)' before ‘BackupProtocolError’
      [ERROR   ] BackupCommands.cpp:266: error: no matching function for call to ‘std::auto_ptr<BackupProtocolMessage>::auto_ptr(int*)’
      [ERROR   ] /usr/lib/gcc/x86_64-redhat-linux/4.1.2/../../../../include/c++/4.1.2/memory:349: note: candidates are: std::auto_ptr<_Tp>::auto_ptr(std::auto_ptr_ref<_Tp>) [with _Tp = BackupProtocolMessage]
      [ERROR   ] /usr/lib/gcc/x86_64-redhat-linux/4.1.2/../../../../include/c++/4.1.2/memory:199: note:                 std::auto_ptr<_Tp>::auto_ptr(std::auto_ptr<_Tp>&) [with _Tp = BackupProtocolMessage]
      [ERROR   ] /usr/lib/gcc/x86_64-redhat-linux/4.1.2/../../../../include/c++/4.1.2/memory:190: note:                 std::auto_ptr<_Tp>::auto_ptr(_Tp*) [with _Tp = BackupProtocolMessage]
      [ERROR   ] BackupCommands.cpp:266: error: expected primary-expression before ‘(’ token
      [ERROR   ] BackupCommands.cpp:266: error: expected type-specifier before ‘BackupProtocolSuccess’
      [ERROR   ] BackupCommands.cpp:266: error: expected `)' before ‘BackupProtocolSuccess’
      [ERROR   ] BackupCommands.cpp: At global scope:
      [ERROR   ] BackupCommands.cpp:280: error: ‘BackupProtocolGetObject’ has not been declared
      [ERROR   ] BackupCommands.cpp:280: error: non-member function ‘std::auto_ptr<BackupProtocolMessage> DoCommand(BackupProtocolReplyable&, BackupStoreContext&)’ cannot have cv-qualifier
      [ERROR   ] BackupCommands.cpp: In function ‘std::auto_ptr<BackupProtocolMessage> DoCommand(BackupProtocolReplyable&, BackupStoreContext&)’:
      [ERROR   ] BackupCommands.cpp:280: error: redefinition of ‘std::auto_ptr<BackupProtocolMessage> DoCommand(BackupProtocolReplyable&, BackupStoreContext&)’
      [ERROR   ] BackupCommands.cpp:58: error: ‘std::auto_ptr<BackupProtocolMessage> DoCommand(BackupProtocolReplyable&, BackupStoreContext&)’ previously defined here
      [ERROR   ] BackupCommands.cpp:282: error: no matching function for call to ‘std::auto_ptr<BackupProtocolMessage>::auto_ptr(int*)’
      [ERROR   ] /usr/lib/gcc/x86_64-redhat-linux/4.1.2/../../../../include/c++/4.1.2/memory:349: note: candidates are: std::auto_ptr<_Tp>::auto_ptr(std::auto_ptr_ref<_Tp>) [with _Tp = BackupProtocolMessage]
      [ERROR   ] /usr/lib/gcc/x86_64-redhat-linux/4.1.2/../../../../include/c++/4.1.2/memory:199: note:                 std::auto_ptr<_Tp>::auto_ptr(std::auto_ptr<_Tp>&) [with _Tp = BackupProtocolMessage]
      [ERROR   ] /usr/lib/gcc/x86_64-redhat-linux/4.1.2/../../../../include/c++/4.1.2/memory:190: note:                 std::auto_ptr<_Tp>::auto_ptr(_Tp*) [with _Tp = BackupProtocolMessage]
      [ERROR   ] BackupCommands.cpp:282: error: expected primary-expression before ‘(’ token
      [ERROR   ] BackupCommands.cpp:282: error: expected type-specifier before ‘BackupProtocolError’
      [ERROR   ] BackupCommands.cpp:282: error: expected `)' before ‘BackupProtocolError’
      [ERROR   ] BackupCommands.cpp:285: error: ‘mObjectID’ was not declared in this scope
      [ERROR   ] BackupCommands.cpp:287: error: no matching function for call to ‘std::auto_ptr<BackupProtocolMessage>::auto_ptr(int*)’
      [ERROR   ] /usr/lib/gcc/x86_64-redhat-linux/4.1.2/../../../../include/c++/4.1.2/memory:349: note: candidates are: std::auto_ptr<_Tp>::auto_ptr(std::auto_ptr_ref<_Tp>) [with _Tp = BackupProtocolMessage]
      [ERROR   ] /usr/lib/gcc/x86_64-redhat-linux/4.1.2/../../../../include/c++/4.1.2/memory:199: note:                 std::auto_ptr<_Tp>::auto_ptr(std::auto_ptr<_Tp>&) [with _Tp = BackupProtocolMessage]
      [ERROR   ] /usr/lib/gcc/x86_64-redhat-linux/4.1.2/../../../../include/c++/4.1.2/memory:190: note:                 std::auto_ptr<_Tp>::auto_ptr(_Tp*) [with _Tp = BackupProtocolMessage]
      [ERROR   ] BackupCommands.cpp:287: error: expected primary-expression before ‘(’ token
      [ERROR   ] BackupCommands.cpp:287: error: expected type-specifier before ‘BackupProtocolSuccess’
      [ERROR   ] BackupCommands.cpp:287: error: expected `)' before ‘BackupProtocolSuccess’
      [ERROR   ] BackupCommands.cpp:291: error: ‘mObjectID’ was not declared in this scope
      [ERROR   ] BackupCommands.cpp:297: error: no matching function for call to ‘std::auto_ptr<BackupProtocolMessage>::auto_ptr(int*)’
      [ERROR   ] /usr/lib/gcc/x86_64-redhat-linux/4.1.2/../../../../include/c++/4.1.2/memory:349: note: candidates are: std::auto_ptr<_Tp>::auto_ptr(std::auto_ptr_ref<_Tp>) [with _Tp = BackupProtocolMessage]
      [ERROR   ] /usr/lib/gcc/x86_64-redhat-linux/4.1.2/../../../../include/c++/4.1.2/memory:199: note:                 std::auto_ptr<_Tp>::auto_ptr(std::auto_ptr<_Tp>&) [with _Tp = BackupProtocolMessage]
      [ERROR   ] /usr/lib/gcc/x86_64-redhat-linux/4.1.2/../../../../include/c++/4.1.2/memory:190: note:                 std::auto_ptr<_Tp>::auto_ptr(_Tp*) [with _Tp = BackupProtocolMessage]
      [ERROR   ] BackupCommands.cpp:297: error: expected primary-expression before ‘(’ token
      [ERROR   ] BackupCommands.cpp:297: error: expected type-specifier before ‘BackupProtocolSuccess’
      [ERROR   ] BackupCommands.cpp:297: error: expected `)' before ‘BackupProtocolSuccess’
      [ERROR   ] BackupCommands.cpp: At global scope:
      [ERROR   ] BackupCommands.cpp:309: error: ‘BackupProtocolGetFile’ has not been declared
      [ERROR   ] BackupCommands.cpp:309: error: non-member function ‘std::auto_ptr<BackupProtocolMessage> DoCommand(BackupProtocolReplyable&, BackupStoreContext&)’ cannot have cv-qualifier
      [ERROR   ] BackupCommands.cpp: In function ‘std::auto_ptr<BackupProtocolMessage> DoCommand(BackupProtocolReplyable&, BackupStoreContext&)’:
      [ERROR   ] BackupCommands.cpp:309: error: redefinition of ‘std::auto_ptr<BackupProtocolMessage> DoCommand(BackupProtocolReplyable&, BackupStoreContext&)’
      [ERROR   ] BackupCommands.cpp:58: error: ‘std::auto_ptr<BackupProtocolMessage> DoCommand(BackupProtocolReplyable&, BackupStoreContext&)’ previously defined here
      [ERROR   ] BackupCommands.cpp:311: error: no matching function for call to ‘std::auto_ptr<BackupProtocolMessage>::auto_ptr(int*)’
      [ERROR   ] /usr/lib/gcc/x86_64-redhat-linux/4.1.2/../../../../include/c++/4.1.2/memory:349: note: candidates are: std::auto_ptr<_Tp>::auto_ptr(std::auto_ptr_ref<_Tp>) [with _Tp = BackupProtocolMessage]
      [ERROR   ] /usr/lib/gcc/x86_64-redhat-linux/4.1.2/../../../../include/c++/4.1.2/memory:199: note:                 std::auto_ptr<_Tp>::auto_ptr(std::auto_ptr<_Tp>&) [with _Tp = BackupProtocolMessage]
      [ERROR   ] /usr/lib/gcc/x86_64-redhat-linux/4.1.2/../../../../include/c++/4.1.2/memory:190: note:                 std::auto_ptr<_Tp>::auto_ptr(_Tp*) [with _Tp = BackupProtocolMessage]
      [ERROR   ] BackupCommands.cpp:311: error: expected primary-expression before ‘(’ token
      [ERROR   ] BackupCommands.cpp:311: error: expected type-specifier before ‘BackupProtocolError’
      [ERROR   ] BackupCommands.cpp:311: error: expected `)' before ‘BackupProtocolError’
      [ERROR   ] BackupCommands.cpp:314: error: ‘mObjectID’ was not declared in this scope
      [ERROR   ] BackupCommands.cpp:315: error: ‘mInDirectory’ was not declared in this scope
      [ERROR   ] BackupCommands.cpp:317: error: no matching function for call to ‘std::auto_ptr<BackupProtocolMessage>::auto_ptr(int*)’
      [ERROR   ] /usr/lib/gcc/x86_64-redhat-linux/4.1.2/../../../../include/c++/4.1.2/memory:349: note: candidates are: std::auto_ptr<_Tp>::auto_ptr(std::auto_ptr_ref<_Tp>) [with _Tp = BackupProtocolMessage]
      [ERROR   ] /usr/lib/gcc/x86_64-redhat-linux/4.1.2/../../../../include/c++/4.1.2/memory:199: note:                 std::auto_ptr<_Tp>::auto_ptr(std::auto_ptr<_Tp>&) [with _Tp = BackupProtocolMessage]
      [ERROR   ] /usr/lib/gcc/x86_64-redhat-linux/4.1.2/../../../../include/c++/4.1.2/memory:190: note:                 std::auto_ptr<_Tp>::auto_ptr(_Tp*) [with _Tp = BackupProtocolMessage]
      [ERROR   ] BackupCommands.cpp:317: error: expected primary-expression before ‘(’ token
      [ERROR   ] BackupCommands.cpp:317: error: expected type-specifier before ‘BackupProtocolError’
      [ERROR   ] BackupCommands.cpp:317: error: expected `)' before ‘BackupProtocolError’
      [ERROR   ] BackupCommands.cpp:321: error: ‘mInDirectory’ was not declared in this scope
      [ERROR   ] BackupCommands.cpp:324: error: ‘mObjectID’ was not declared in this scope
      [ERROR   ] BackupCommands.cpp:327: error: no matching function for call to ‘std::auto_ptr<BackupProtocolMessage>::auto_ptr(int*)’
      [ERROR   ] /usr/lib/gcc/x86_64-redhat-linux/4.1.2/../../../../include/c++/4.1.2/memory:349: note: candidates are: std::auto_ptr<_Tp>::auto_ptr(std::auto_ptr_ref<_Tp>) [with _Tp = BackupProtocolMessage]
      [ERROR   ] /usr/lib/gcc/x86_64-redhat-linux/4.1.2/../../../../include/c++/4.1.2/memory:199: note:                 std::auto_ptr<_Tp>::auto_ptr(std::auto_ptr<_Tp>&) [with _Tp = BackupProtocolMessage]
      [ERROR   ] /usr/lib/gcc/x86_64-redhat-linux/4.1.2/../../../../include/c++/4.1.2/memory:190: note:                 std::auto_ptr<_Tp>::auto_ptr(_Tp*) [with _Tp = BackupProtocolMessage]
      [ERROR   ] BackupCommands.cpp:327: error: expected primary-expression before ‘(’ token
      [ERROR   ] BackupCommands.cpp:327: error: expected type-specifier before ‘BackupProtocolError’
      [ERROR   ] BackupCommands.cpp:327: error: expected `)' before ‘BackupProtocolError’
      [ERROR   ] BackupCommands.cpp:355: error: no matching function for call to ‘std::auto_ptr<BackupProtocolMessage>::auto_ptr(int*)’
      [ERROR   ] /usr/lib/gcc/x86_64-redhat-linux/4.1.2/../../../../include/c++/4.1.2/memory:349: note: candidates are: std::auto_ptr<_Tp>::auto_ptr(std::auto_ptr_ref<_Tp>) [with _Tp = BackupProtocolMessage]
      [ERROR   ] /usr/lib/gcc/x86_64-redhat-linux/4.1.2/../../../../include/c++/4.1.2/memory:199: note:                 std::auto_ptr<_Tp>::auto_ptr(std::auto_ptr<_Tp>&) [with _Tp = BackupProtocolMessage]
      [ERROR   ] /usr/lib/gcc/x86_64-redhat-linux/4.1.2/../../../../include/c++/4.1.2/memory:190: note:                 std::auto_ptr<_Tp>::auto_ptr(_Tp*) [with _Tp = BackupProtocolMessage]
      [ERROR   ] BackupCommands.cpp:355: error: expected primary-expression before ‘(’ token
      [ERROR   ] BackupCommands.cpp:355: error: expected type-specifier before ‘BackupProtocolError’
      [ERROR   ] BackupCommands.cpp:355: error: expected `)' before ‘BackupProtocolError’
      [ERROR   ] BackupCommands.cpp:437: error: no matching function for call to ‘std::auto_ptr<BackupProtocolMessage>::auto_ptr(int*)’
      [ERROR   ] /usr/lib/gcc/x86_64-redhat-linux/4.1.2/../../../../include/c++/4.1.2/memory:349: note: candidates are: std::auto_ptr<_Tp>::auto_ptr(std::auto_ptr_ref<_Tp>) [with _Tp = BackupProtocolMessage]
      [ERROR   ] /usr/lib/gcc/x86_64-redhat-linux/4.1.2/../../../../include/c++/4.1.2/memory:199: note:                 std::auto_ptr<_Tp>::auto_ptr(std::auto_ptr<_Tp>&) [with _Tp = BackupProtocolMessage]
      [ERROR   ] /usr/lib/gcc/x86_64-redhat-linux/4.1.2/../../../../include/c++/4.1.2/memory:190: note:                 std::auto_ptr<_Tp>::auto_ptr(_Tp*) [with _Tp = BackupProtocolMessage]
      [ERROR   ] BackupCommands.cpp:437: error: expected primary-expression before ‘(’ token
      [ERROR   ] BackupCommands.cpp:437: error: expected type-specifier before ‘BackupProtocolError’
      [ERROR   ] BackupCommands.cpp:437: error: expected `)' before ‘BackupProtocolError’
      [ERROR   ] BackupCommands.cpp:463: error: no matching function for call to ‘std::auto_ptr<BackupProtocolMessage>::auto_ptr(int*)’
      [ERROR   ] /usr/lib/gcc/x86_64-redhat-linux/4.1.2/../../../../include/c++/4.1.2/memory:349: note: candidates are: std::auto_ptr<_Tp>::auto_ptr(std::auto_ptr_ref<_Tp>) [with _Tp = BackupProtocolMessage]
      [ERROR   ] /usr/lib/gcc/x86_64-redhat-linux/4.1.2/../../../../include/c++/4.1.2/memory:199: note:                 std::auto_ptr<_Tp>::auto_ptr(std::auto_ptr<_Tp>&) [with _Tp = BackupProtocolMessage]
      [ERROR   ] /usr/lib/gcc/x86_64-redhat-linux/4.1.2/../../../../include/c++/4.1.2/memory:190: note:                 std::auto_ptr<_Tp>::auto_ptr(_Tp*) [with _Tp = BackupProtocolMessage]
      [ERROR   ] BackupCommands.cpp:463: error: expected primary-expression before ‘(’ token
      [ERROR   ] BackupCommands.cpp:463: error: expected type-specifier before ‘BackupProtocolSuccess’
      [ERROR   ] BackupCommands.cpp:463: error: expected `)' before ‘BackupProtocolSuccess’
      [ERROR   ] BackupCommands.cpp: At global scope:
      [ERROR   ] BackupCommands.cpp:475: error: ‘BackupProtocolCreateDirectory’ has not been declared
      [ERROR   ] BackupCommands.cpp:475: error: non-member function ‘std::auto_ptr<BackupProtocolMessage> DoCommand(BackupProtocolReplyable&, BackupStoreContext&)’ cannot have cv-qualifier
      [ERROR   ] BackupCommands.cpp: In function ‘std::auto_ptr<BackupProtocolMessage> DoCommand(BackupProtocolReplyable&, BackupStoreContext&)’:
      [ERROR   ] BackupCommands.cpp:475: error: redefinition of ‘std::auto_ptr<BackupProtocolMessage> DoCommand(BackupProtocolReplyable&, BackupStoreContext&)’
      [ERROR   ] BackupCommands.cpp:58: error: ‘std::auto_ptr<BackupProtocolMessage> DoCommand(BackupProtocolReplyable&, BackupStoreContext&)’ previously defined here
      [ERROR   ] BackupCommands.cpp:477: error: no matching function for call to ‘std::auto_ptr<BackupProtocolMessage>::auto_ptr(int*)’
      [ERROR   ] /usr/lib/gcc/x86_64-redhat-linux/4.1.2/../../../../include/c++/4.1.2/memory:349: note: candidates are: std::auto_ptr<_Tp>::auto_ptr(std::auto_ptr_ref<_Tp>) [with _Tp = BackupProtocolMessage]
      [ERROR   ] /usr/lib/gcc/x86_64-redhat-linux/4.1.2/../../../../include/c++/4.1.2/memory:199: note:                 std::auto_ptr<_Tp>::auto_ptr(std::auto_ptr<_Tp>&) [with _Tp = BackupProtocolMessage]
      [ERROR   ] /usr/lib/gcc/x86_64-redhat-linux/4.1.2/../../../../include/c++/4.1.2/memory:190: note:                 std::auto_ptr<_Tp>::auto_ptr(_Tp*) [with _Tp = BackupProtocolMessage]
      [ERROR   ] BackupCommands.cpp:477: error: expected primary-expression before ‘(’ token
      [ERROR   ] BackupCommands.cpp:477: error: expected type-specifier before ‘BackupProtocolError’
      [ERROR   ] BackupCommands.cpp:477: error: expected `)' before ‘BackupProtocolError’
      [ERROR   ] BackupCommands.cpp:478: error: no matching function for call to ‘std::auto_ptr<BackupProtocolMessage>::auto_ptr(int*)’
      [ERROR   ] /usr/lib/gcc/x86_64-redhat-linux/4.1.2/../../../../include/c++/4.1.2/memory:349: note: candidates are: std::auto_ptr<_Tp>::auto_ptr(std::auto_ptr_ref<_Tp>) [with _Tp = BackupProtocolMessage]
      [ERROR   ] /usr/lib/gcc/x86_64-redhat-linux/4.1.2/../../../../include/c++/4.1.2/memory:199: note:                 std::auto_ptr<_Tp>::auto_ptr(std::auto_ptr<_Tp>&) [with _Tp = BackupProtocolMessage]
      [ERROR   ] /usr/lib/gcc/x86_64-redhat-linux/4.1.2/../../../../include/c++/4.1.2/memory:190: note:                 std::auto_ptr<_Tp>::auto_ptr(_Tp*) [with _Tp = BackupProtocolMessage]
      [ERROR   ] BackupCommands.cpp:478: error: expected primary-expression before ‘(’ token
      [ERROR   ] BackupCommands.cpp:478: error: expected type-specifier before ‘BackupProtocolError’
      [ERROR   ] BackupCommands.cpp:478: error: expected `)' before ‘BackupProtocolError’
      [ERROR   ] BackupCommands.cpp:491: error: no matching function for call to ‘std::auto_ptr<BackupProtocolMessage>::auto_ptr(int*)’
      [ERROR   ] /usr/lib/gcc/x86_64-redhat-linux/4.1.2/../../../../include/c++/4.1.2/memory:349: note: candidates are: std::auto_ptr<_Tp>::auto_ptr(std::auto_ptr_ref<_Tp>) [with _Tp = BackupProtocolMessage]
      [ERROR   ] /usr/lib/gcc/x86_64-redhat-linux/4.1.2/../../../../include/c++/4.1.2/memory:199: note:                 std::auto_ptr<_Tp>::auto_ptr(std::auto_ptr<_Tp>&) [with _Tp = BackupProtocolMessage]
      [ERROR   ] /usr/lib/gcc/x86_64-redhat-linux/4.1.2/../../../../include/c++/4.1.2/memory:190: note:                 std::auto_ptr<_Tp>::auto_ptr(_Tp*) [with _Tp = BackupProtocolMessage]
      [ERROR   ] BackupCommands.cpp:491: error: expected primary-expression before ‘(’ token
      [ERROR   ] BackupCommands.cpp:491: error: expected type-specifier before ‘BackupProtocolError’
      [ERROR   ] BackupCommands.cpp:491: error: expected `)' before ‘BackupProtocolError’
      [ERROR   ] BackupCommands.cpp:495: error: ‘mContainingDirectoryID’ was not declared in this scope
      [ERROR   ] BackupCommands.cpp:495: error: ‘mDirectoryName’ was not declared in this scope
      [ERROR   ] BackupCommands.cpp:495: error: ‘mAttributesModTime’ was not declared in this scope
      [ERROR   ] BackupCommands.cpp:499: error: no matching function for call to ‘std::auto_ptr<BackupProtocolMessage>::auto_ptr(int*)’
      [ERROR   ] /usr/lib/gcc/x86_64-redhat-linux/4.1.2/../../../../include/c++/4.1.2/memory:349: note: candidates are: std::auto_ptr<_Tp>::auto_ptr(std::auto_ptr_ref<_Tp>) [with _Tp = BackupProtocolMessage]
      [ERROR   ] /usr/lib/gcc/x86_64-redhat-linux/4.1.2/../../../../include/c++/4.1.2/memory:199: note:                 std::auto_ptr<_Tp>::auto_ptr(std::auto_ptr<_Tp>&) [with _Tp = BackupProtocolMessage]
      [ERROR   ] /usr/lib/gcc/x86_64-redhat-linux/4.1.2/../../../../include/c++/4.1.2/memory:190: note:                 std::auto_ptr<_Tp>::auto_ptr(_Tp*) [with _Tp = BackupProtocolMessage]
      [ERROR   ] BackupCommands.cpp:499: error: expected primary-expression before ‘(’ token
      [ERROR   ] BackupCommands.cpp:499: error: expected type-specifier before ‘BackupProtocolError’
      [ERROR   ] BackupCommands.cpp:499: error: expected `)' before ‘BackupProtocolError’
      [ERROR   ] BackupCommands.cpp:503: error: no matching function for call to ‘std::auto_ptr<BackupProtocolMessage>::auto_ptr(int*)’
      [ERROR   ] /usr/lib/gcc/x86_64-redhat-linux/4.1.2/../../../../include/c++/4.1.2/memory:349: note: candidates are: std::auto_ptr<_Tp>::auto_ptr(std::auto_ptr_ref<_Tp>) [with _Tp = BackupProtocolMessage]
      [ERROR   ] /usr/lib/gcc/x86_64-redhat-linux/4.1.2/../../../../include/c++/4.1.2/memory:199: note:                 std::auto_ptr<_Tp>::auto_ptr(std::auto_ptr<_Tp>&) [with _Tp = BackupProtocolMessage]
      [ERROR   ] /usr/lib/gcc/x86_64-redhat-linux/4.1.2/../../../../include/c++/4.1.2/memory:190: note:                 std::auto_ptr<_Tp>::auto_ptr(_Tp*) [with _Tp = BackupProtocolMessage]
      [ERROR   ] BackupCommands.cpp:503: error: expected primary-expression before ‘(’ token
      [ERROR   ] BackupCommands.cpp:503: error: expected type-specifier before ‘BackupProtocolSuccess’
      [ERROR   ] BackupCommands.cpp:503: error: expected `)' before ‘BackupProtocolSuccess’
      [ERROR   ] BackupCommands.cpp:495: warning: unused variable ‘id’
      [ERROR   ] BackupCommands.cpp: At global scope:
      [ERROR   ] BackupCommands.cpp:516: error: ‘BackupProtocolChangeDirAttributes’ has not been declared
      [ERROR   ] BackupCommands.cpp:516: error: non-member function ‘std::auto_ptr<BackupProtocolMessage> DoCommand(BackupProtocolReplyable&, BackupStoreContext&)’ cannot have cv-qualifier
      [ERROR   ] BackupCommands.cpp: In function ‘std::auto_ptr<BackupProtocolMessage> DoCommand(BackupProtocolReplyable&, BackupStoreContext&)’:
      [ERROR   ] BackupCommands.cpp:516: error: redefinition of ‘std::auto_ptr<BackupProtocolMessage> DoCommand(BackupProtocolReplyable&, BackupStoreContext&)’
      [ERROR   ] BackupCommands.cpp:58: error: ‘std::auto_ptr<BackupProtocolMessage> DoCommand(BackupProtocolReplyable&, BackupStoreContext&)’ previously defined here
      [ERROR   ] BackupCommands.cpp:518: error: no matching function for call to ‘std::auto_ptr<BackupProtocolMessage>::auto_ptr(int*)’
      [ERROR   ] /usr/lib/gcc/x86_64-redhat-linux/4.1.2/../../../../include/c++/4.1.2/memory:349: note: candidates are: std::auto_ptr<_Tp>::auto_ptr(std::auto_ptr_ref<_Tp>) [with _Tp = BackupProtocolMessage]
      [ERROR   ] /usr/lib/gcc/x86_64-redhat-linux/4.1.2/../../../../include/c++/4.1.2/memory:199: note:                 std::auto_ptr<_Tp>::auto_ptr(std::auto_ptr<_Tp>&) [with _Tp = BackupProtocolMessage]
      [ERROR   ] /usr/lib/gcc/x86_64-redhat-linux/4.1.2/../../../../include/c++/4.1.2/memory:190: note:                 std::auto_ptr<_Tp>::auto_ptr(_Tp*) [with _Tp = BackupProtocolMessage]
      [ERROR   ] BackupCommands.cpp:518: error: expected primary-expression before ‘(’ token
      [ERROR   ] BackupCommands.cpp:518: error: expected type-specifier before ‘BackupProtocolError’
      [ERROR   ] BackupCommands.cpp:518: error: expected `)' before ‘BackupProtocolError’
      [ERROR   ] BackupCommands.cpp:519: error: no matching function for call to ‘std::auto_ptr<BackupProtocolMessage>::auto_ptr(int*)’
      [ERROR   ] /usr/lib/gcc/x86_64-redhat-linux/4.1.2/../../../../include/c++/4.1.2/memory:349: note: candidates are: std::auto_ptr<_Tp>::auto_ptr(std::auto_ptr_ref<_Tp>) [with _Tp = BackupProtocolMessage]
      [ERROR   ] /usr/lib/gcc/x86_64-redhat-linux/4.1.2/../../../../include/c++/4.1.2/memory:199: note:                 std::auto_ptr<_Tp>::auto_ptr(std::auto_ptr<_Tp>&) [with _Tp = BackupProtocolMessage]
      [ERROR   ] /usr/lib/gcc/x86_64-redhat-linux/4.1.2/../../../../include/c++/4.1.2/memory:190: note:                 std::auto_ptr<_Tp>::auto_ptr(_Tp*) [with _Tp = BackupProtocolMessage]
      [ERROR   ] BackupCommands.cpp:519: error: expected primary-expression before ‘(’ token
      [ERROR   ] BackupCommands.cpp:519: error: expected type-specifier before ‘BackupProtocolError’
      [ERROR   ] BackupCommands.cpp:519: error: expected `)' before ‘BackupProtocolError’
      [ERROR   ] BackupCommands.cpp:529: error: ‘mObjectID’ was not declared in this scope
      [ERROR   ] BackupCommands.cpp:529: error: ‘mAttributesModTime’ was not declared in this scope
      [ERROR   ] BackupCommands.cpp:532: error: no matching function for call to ‘std::auto_ptr<BackupProtocolMessage>::auto_ptr(int*)’
      [ERROR   ] /usr/lib/gcc/x86_64-redhat-linux/4.1.2/../../../../include/c++/4.1.2/memory:349: note: candidates are: std::auto_ptr<_Tp>::auto_ptr(std::auto_ptr_ref<_Tp>) [with _Tp = BackupProtocolMessage]
      [ERROR   ] /usr/lib/gcc/x86_64-redhat-linux/4.1.2/../../../../include/c++/4.1.2/memory:199: note:                 std::auto_ptr<_Tp>::auto_ptr(std::auto_ptr<_Tp>&) [with _Tp = BackupProtocolMessage]
      [ERROR   ] /usr/lib/gcc/x86_64-redhat-linux/4.1.2/../../../../include/c++/4.1.2/memory:190: note:                 std::auto_ptr<_Tp>::auto_ptr(_Tp*) [with _Tp = BackupProtocolMessage]
      [ERROR   ] BackupCommands.cpp:532: error: expected primary-expression before ‘(’ token
      [ERROR   ] BackupCommands.cpp:532: error: expected type-specifier before ‘BackupProtocolSuccess’
      [ERROR   ] BackupCommands.cpp:532: error: expected `)' before ‘BackupProtocolSuccess’
      [ERROR   ] BackupCommands.cpp: At global scope:
      [ERROR   ] BackupCommands.cpp:544: error: ‘BackupProtocolSetReplacementFileAttributes’ has not been declared
      [ERROR   ] BackupCommands.cpp:544: error: non-member function ‘std::auto_ptr<BackupProtocolMessage> DoCommand(BackupProtocolReplyable&, BackupStoreContext&)’ cannot have cv-qualifier
      [ERROR   ] BackupCommands.cpp: In function ‘std::auto_ptr<BackupProtocolMessage> DoCommand(BackupProtocolReplyable&, BackupStoreContext&)’:
      [ERROR   ] BackupCommands.cpp:544: error: redefinition of ‘std::auto_ptr<BackupProtocolMessage> DoCommand(BackupProtocolReplyable&, BackupStoreContext&)’
      [ERROR   ] BackupCommands.cpp:58: error: ‘std::auto_ptr<BackupProtocolMessage> DoCommand(BackupProtocolReplyable&, BackupStoreContext&)’ previously defined here
      [ERROR   ] BackupCommands.cpp:546: error: no matching function for call to ‘std::auto_ptr<BackupProtocolMessage>::auto_ptr(int*)’
      [ERROR   ] /usr/lib/gcc/x86_64-redhat-linux/4.1.2/../../../../include/c++/4.1.2/memory:349: note: candidates are: std::auto_ptr<_Tp>::auto_ptr(std::auto_ptr_ref<_Tp>) [with _Tp = BackupProtocolMessage]
      [ERROR   ] /usr/lib/gcc/x86_64-redhat-linux/4.1.2/../../../../include/c++/4.1.2/memory:199: note:                 std::auto_ptr<_Tp>::auto_ptr(std::auto_ptr<_Tp>&) [with _Tp = BackupProtocolMessage]
      [ERROR   ] /usr/lib/gcc/x86_64-redhat-linux/4.1.2/../../../../include/c++/4.1.2/memory:190: note:                 std::auto_ptr<_Tp>::auto_ptr(_Tp*) [with _Tp = BackupProtocolMessage]
      [ERROR   ] BackupCommands.cpp:546: error: expected primary-expression before ‘(’ token
      [ERROR   ] BackupCommands.cpp:546: error: expected type-specifier before ‘BackupProtocolError’
      [ERROR   ] BackupCommands.cpp:546: error: expected `)' before ‘BackupProtocolError’
      [ERROR   ] BackupCommands.cpp:547: error: no matching function for call to ‘std::auto_ptr<BackupProtocolMessage>::auto_ptr(int*)’
      [ERROR   ] /usr/lib/gcc/x86_64-redhat-linux/4.1.2/../../../../include/c++/4.1.2/memory:349: note: candidates are: std::auto_ptr<_Tp>::auto_ptr(std::auto_ptr_ref<_Tp>) [with _Tp = BackupProtocolMessage]
      [ERROR   ] /usr/lib/gcc/x86_64-redhat-linux/4.1.2/../../../../include/c++/4.1.2/memory:199: note:                 std::auto_ptr<_Tp>::auto_ptr(std::auto_ptr<_Tp>&) [with _Tp = BackupProtocolMessage]
      [ERROR   ] /usr/lib/gcc/x86_64-redhat-linux/4.1.2/../../../../include/c++/4.1.2/memory:190: note:                 std::auto_ptr<_Tp>::auto_ptr(_Tp*) [with _Tp = BackupProtocolMessage]
      [ERROR   ] BackupCommands.cpp:547: error: expected primary-expression before ‘(’ token
      [ERROR   ] BackupCommands.cpp:547: error: expected type-specifier before ‘BackupProtocolError’
      [ERROR   ] BackupCommands.cpp:547: error: expected `)' before ‘BackupProtocolError’
      [ERROR   ] BackupCommands.cpp:558: error: ‘mFilename’ was not declared in this scope
      [ERROR   ] BackupCommands.cpp:558: error: ‘mInDirectory’ was not declared in this scope
      [ERROR   ] BackupCommands.cpp:558: error: ‘mAttributesHash’ was not declared in this scope
      [ERROR   ] BackupCommands.cpp:561: error: no matching function for call to ‘std::auto_ptr<BackupProtocolMessage>::auto_ptr(int*)’
      [ERROR   ] /usr/lib/gcc/x86_64-redhat-linux/4.1.2/../../../../include/c++/4.1.2/memory:349: note: candidates are: std::auto_ptr<_Tp>::auto_ptr(std::auto_ptr_ref<_Tp>) [with _Tp = BackupProtocolMessage]
      [ERROR   ] /usr/lib/gcc/x86_64-redhat-linux/4.1.2/../../../../include/c++/4.1.2/memory:199: note:                 std::auto_ptr<_Tp>::auto_ptr(std::auto_ptr<_Tp>&) [with _Tp = BackupProtocolMessage]
      [ERROR   ] /usr/lib/gcc/x86_64-redhat-linux/4.1.2/../../../../include/c++/4.1.2/memory:190: note:                 std::auto_ptr<_Tp>::auto_ptr(_Tp*) [with _Tp = BackupProtocolMessage]
      [ERROR   ] BackupCommands.cpp:561: error: expected primary-expression before ‘(’ token
      [ERROR   ] BackupCommands.cpp:561: error: expected type-specifier before ‘BackupProtocolError’
      [ERROR   ] BackupCommands.cpp:561: error: expected `)' before ‘BackupProtocolError’
      [ERROR   ] BackupCommands.cpp:565: error: no matching function for call to ‘std::auto_ptr<BackupProtocolMessage>::auto_ptr(int*)’
      [ERROR   ] /usr/lib/gcc/x86_64-redhat-linux/4.1.2/../../../../include/c++/4.1.2/memory:349: note: candidates are: std::auto_ptr<_Tp>::auto_ptr(std::auto_ptr_ref<_Tp>) [with _Tp = BackupProtocolMessage]
      [ERROR   ] /usr/lib/gcc/x86_64-redhat-linux/4.1.2/../../../../include/c++/4.1.2/memory:199: note:                 std::auto_ptr<_Tp>::auto_ptr(std::auto_ptr<_Tp>&) [with _Tp = BackupProtocolMessage]
      [ERROR   ] /usr/lib/gcc/x86_64-redhat-linux/4.1.2/../../../../include/c++/4.1.2/memory:190: note:                 std::auto_ptr<_Tp>::auto_ptr(_Tp*) [with _Tp = BackupProtocolMessage]
      [ERROR   ] BackupCommands.cpp:565: error: expected primary-expression before ‘(’ token
      [ERROR   ] BackupCommands.cpp:565: error: expected type-specifier before ‘BackupProtocolSuccess’
      [ERROR   ] BackupCommands.cpp:565: error: expected `)' before ‘BackupProtocolSuccess’
      [ERROR   ] BackupCommands.cpp: At global scope:
      [ERROR   ] BackupCommands.cpp:578: error: ‘BackupProtocolDeleteFile’ has not been declared
      [ERROR   ] BackupCommands.cpp:578: error: non-member function ‘std::auto_ptr<BackupProtocolMessage> DoCommand(BackupProtocolReplyable&, BackupStoreContext&)’ cannot have cv-qualifier
      [ERROR   ] BackupCommands.cpp: In function ‘std::auto_ptr<BackupProtocolMessage> DoCommand(BackupProtocolReplyable&, BackupStoreContext&)’:
      [ERROR   ] BackupCommands.cpp:578: error: redefinition of ‘std::auto_ptr<BackupProtocolMessage> DoCommand(BackupProtocolReplyable&, BackupStoreContext&)’
      [ERROR   ] BackupCommands.cpp:58: error: ‘std::auto_ptr<BackupProtocolMessage> DoCommand(BackupProtocolReplyable&, BackupStoreContext&)’ previously defined here
      [ERROR   ] BackupCommands.cpp:580: error: no matching function for call to ‘std::auto_ptr<BackupProtocolMessage>::auto_ptr(int*)’
      [ERROR   ] /usr/lib/gcc/x86_64-redhat-linux/4.1.2/../../../../include/c++/4.1.2/memory:349: note: candidates are: std::auto_ptr<_Tp>::auto_ptr(std::auto_ptr_ref<_Tp>) [with _Tp = BackupProtocolMessage]
      [ERROR   ] /usr/lib/gcc/x86_64-redhat-linux/4.1.2/../../../../include/c++/4.1.2/memory:199: note:                 std::auto_ptr<_Tp>::auto_ptr(std::auto_ptr<_Tp>&) [with _Tp = BackupProtocolMessage]
      [ERROR   ] /usr/lib/gcc/x86_64-redhat-linux/4.1.2/../../../../include/c++/4.1.2/memory:190: note:                 std::auto_ptr<_Tp>::auto_ptr(_Tp*) [with _Tp = BackupProtocolMessage]
      [ERROR   ] BackupCommands.cpp:580: error: expected primary-expression before ‘(’ token
      [ERROR   ] BackupCommands.cpp:580: error: expected type-specifier before ‘BackupProtocolError’
      [ERROR   ] BackupCommands.cpp:580: error: expected `)' before ‘BackupProtocolError’
      [ERROR   ] BackupCommands.cpp:581: error: no matching function for call to ‘std::auto_ptr<BackupProtocolMessage>::auto_ptr(int*)’
      [ERROR   ] /usr/lib/gcc/x86_64-redhat-linux/4.1.2/../../../../include/c++/4.1.2/memory:349: note: candidates are: std::auto_ptr<_Tp>::auto_ptr(std::auto_ptr_ref<_Tp>) [with _Tp = BackupProtocolMessage]
      [ERROR   ] /usr/lib/gcc/x86_64-redhat-linux/4.1.2/../../../../include/c++/4.1.2/memory:199: note:                 std::auto_ptr<_Tp>::auto_ptr(std::auto_ptr<_Tp>&) [with _Tp = BackupProtocolMessage]
      [ERROR   ] /usr/lib/gcc/x86_64-redhat-linux/4.1.2/../../../../include/c++/4.1.2/memory:190: note:                 std::auto_ptr<_Tp>::auto_ptr(_Tp*) [with _Tp = BackupProtocolMessage]
      [ERROR   ] BackupCommands.cpp:581: error: expected primary-expression before ‘(’ token
      [ERROR   ] BackupCommands.cpp:581: error: expected type-specifier before ‘BackupProtocolError’
      [ERROR   ] BackupCommands.cpp:581: error: expected `)' before ‘BackupProtocolError’
      [ERROR   ] BackupCommands.cpp:585: error: ‘mFilename’ was not declared in this scope
      [ERROR   ] BackupCommands.cpp:585: error: ‘mInDirectory’ was not declared in this scope
      [ERROR   ] BackupCommands.cpp:588: error: no matching function for call to ‘std::auto_ptr<BackupProtocolMessage>::auto_ptr(int*)’
      [ERROR   ] /usr/lib/gcc/x86_64-redhat-linux/4.1.2/../../../../include/c++/4.1.2/memory:349: note: candidates are: std::auto_ptr<_Tp>::auto_ptr(std::auto_ptr_ref<_Tp>) [with _Tp = BackupProtocolMessage]
      [ERROR   ] /usr/lib/gcc/x86_64-redhat-linux/4.1.2/../../../../include/c++/4.1.2/memory:199: note:                 std::auto_ptr<_Tp>::auto_ptr(std::auto_ptr<_Tp>&) [with _Tp = BackupProtocolMessage]
      [ERROR   ] /usr/lib/gcc/x86_64-redhat-linux/4.1.2/../../../../include/c++/4.1.2/memory:190: note:                 std::auto_ptr<_Tp>::auto_ptr(_Tp*) [with _Tp = BackupProtocolMessage]
      [ERROR   ] BackupCommands.cpp:588: error: expected primary-expression before ‘(’ token
      [ERROR   ] BackupCommands.cpp:588: error: expected type-specifier before ‘BackupProtocolSuccess’
      [ERROR   ] BackupCommands.cpp:588: error: expected `)' before ‘BackupProtocolSuccess’
      [ERROR   ] BackupCommands.cpp: At global scope:
      [ERROR   ] BackupCommands.cpp:601: error: ‘BackupProtocolUndeleteFile’ has not been declared
      [ERROR   ] BackupCommands.cpp:602: error: non-member function ‘std::auto_ptr<BackupProtocolMessage> DoCommand(BackupProtocolReplyable&, BackupStoreContext&)’ cannot have cv-qualifier
      [ERROR   ] BackupCommands.cpp: In function ‘std::auto_ptr<BackupProtocolMessage> DoCommand(BackupProtocolReplyable&, BackupStoreContext&)’:
      [ERROR   ] BackupCommands.cpp:602: error: redefinition of ‘std::auto_ptr<BackupProtocolMessage> DoCommand(BackupProtocolReplyable&, BackupStoreContext&)’
      [ERROR   ] BackupCommands.cpp:58: error: ‘std::auto_ptr<BackupProtocolMessage> DoCommand(BackupProtocolReplyable&, BackupStoreContext&)’ previously defined here
      [ERROR   ] BackupCommands.cpp:604: error: no matching function for call to ‘std::auto_ptr<BackupProtocolMessage>::auto_ptr(int*)’
      [ERROR   ] /usr/lib/gcc/x86_64-redhat-linux/4.1.2/../../../../include/c++/4.1.2/memory:349: note: candidates are: std::auto_ptr<_Tp>::auto_ptr(std::auto_ptr_ref<_Tp>) [with _Tp = BackupProtocolMessage]
      [ERROR   ] /usr/lib/gcc/x86_64-redhat-linux/4.1.2/../../../../include/c++/4.1.2/memory:199: note:                 std::auto_ptr<_Tp>::auto_ptr(std::auto_ptr<_Tp>&) [with _Tp = BackupProtocolMessage]
      [ERROR   ] /usr/lib/gcc/x86_64-redhat-linux/4.1.2/../../../../include/c++/4.1.2/memory:190: note:                 std::auto_ptr<_Tp>::auto_ptr(_Tp*) [with _Tp = BackupProtocolMessage]
      [ERROR   ] BackupCommands.cpp:604: error: expected primary-expression before ‘(’ token
      [ERROR   ] BackupCommands.cpp:604: error: expected type-specifier before ‘BackupProtocolError’
      [ERROR   ] BackupCommands.cpp:604: error: expected `)' before ‘BackupProtocolError’
      [ERROR   ] BackupCommands.cpp:605: error: no matching function for call to ‘std::auto_ptr<BackupProtocolMessage>::auto_ptr(int*)’
      [ERROR   ] /usr/lib/gcc/x86_64-redhat-linux/4.1.2/../../../../include/c++/4.1.2/memory:349: note: candidates are: std::auto_ptr<_Tp>::auto_ptr(std::auto_ptr_ref<_Tp>) [with _Tp = BackupProtocolMessage]
      [ERROR   ] /usr/lib/gcc/x86_64-redhat-linux/4.1.2/../../../../include/c++/4.1.2/memory:199: note:                 std::auto_ptr<_Tp>::auto_ptr(std::auto_ptr<_Tp>&) [with _Tp = BackupProtocolMessage]
      [ERROR   ] /usr/lib/gcc/x86_64-redhat-linux/4.1.2/../../../../include/c++/4.1.2/memory:190: note:                 std::auto_ptr<_Tp>::auto_ptr(_Tp*) [with _Tp = BackupProtocolMessage]
      [ERROR   ] BackupCommands.cpp:605: error: expected primary-expression before ‘(’ token
      [ERROR   ] BackupCommands.cpp:605: error: expected type-specifier before ‘BackupProtocolError’
      [ERROR   ] BackupCommands.cpp:605: error: expected `)' before ‘BackupProtocolError’
      [ERROR   ] BackupCommands.cpp:608: error: ‘mObjectID’ was not declared in this scope
      [ERROR   ] BackupCommands.cpp:608: error: ‘mInDirectory’ was not declared in this scope
      [ERROR   ] BackupCommands.cpp:612: error: no matching function for call to ‘std::auto_ptr<BackupProtocolMessage>::auto_ptr(int*)’
      [ERROR   ] /usr/lib/gcc/x86_64-redhat-linux/4.1.2/../../../../include/c++/4.1.2/memory:349: note: candidates are: std::auto_ptr<_Tp>::auto_ptr(std::auto_ptr_ref<_Tp>) [with _Tp = BackupProtocolMessage]
      [ERROR   ] /usr/lib/gcc/x86_64-redhat-linux/4.1.2/../../../../include/c++/4.1.2/memory:199: note:                 std::auto_ptr<_Tp>::auto_ptr(std::auto_ptr<_Tp>&) [with _Tp = BackupProtocolMessage]
      [ERROR   ] /usr/lib/gcc/x86_64-redhat-linux/4.1.2/../../../../include/c++/4.1.2/memory:190: note:                 std::auto_ptr<_Tp>::auto_ptr(_Tp*) [with _Tp = BackupProtocolMessage]
      [ERROR   ] BackupCommands.cpp:611: error: expected primary-expression before ‘(’ token
      [ERROR   ] BackupCommands.cpp:612: error: expected type-specifier before ‘BackupProtocolSuccess’
      [ERROR   ] BackupCommands.cpp:612: error: expected `)' before ‘BackupProtocolSuccess’
      [ERROR   ] BackupCommands.cpp:608: warning: unused variable ‘result’
      [ERROR   ] BackupCommands.cpp: At global scope:
      [ERROR   ] BackupCommands.cpp:624: error: ‘BackupProtocolDeleteDirectory’ has not been declared
      [ERROR   ] BackupCommands.cpp:624: error: non-member function ‘std::auto_ptr<BackupProtocolMessage> DoCommand(BackupProtocolReplyable&, BackupStoreContext&)’ cannot have cv-qualifier
      [ERROR   ] BackupCommands.cpp: In function ‘std::auto_ptr<BackupProtocolMessage> DoCommand(BackupProtocolReplyable&, BackupStoreContext&)’:
      [ERROR   ] BackupCommands.cpp:624: error: redefinition of ‘std::auto_ptr<BackupProtocolMessage> DoCommand(BackupProtocolReplyable&, BackupStoreContext&)’
      [ERROR   ] BackupCommands.cpp:58: error: ‘std::auto_ptr<BackupProtocolMessage> DoCommand(BackupProtocolReplyable&, BackupStoreContext&)’ previously defined here
      [ERROR   ] BackupCommands.cpp:626: error: no matching function for call to ‘std::auto_ptr<BackupProtocolMessage>::auto_ptr(int*)’
      [ERROR   ] /usr/lib/gcc/x86_64-redhat-linux/4.1.2/../../../../include/c++/4.1.2/memory:349: note: candidates are: std::auto_ptr<_Tp>::auto_ptr(std::auto_ptr_ref<_Tp>) [with _Tp = BackupProtocolMessage]
      [ERROR   ] /usr/lib/gcc/x86_64-redhat-linux/4.1.2/../../../../include/c++/4.1.2/memory:199: note:                 std::auto_ptr<_Tp>::auto_ptr(std::auto_ptr<_Tp>&) [with _Tp = BackupProtocolMessage]
      [ERROR   ] /usr/lib/gcc/x86_64-redhat-linux/4.1.2/../../../../include/c++/4.1.2/memory:190: note:                 std::auto_ptr<_Tp>::auto_ptr(_Tp*) [with _Tp = BackupProtocolMessage]
      [ERROR   ] BackupCommands.cpp:626: error: expected primary-expression before ‘(’ token
      [ERROR   ] BackupCommands.cpp:626: error: expected type-specifier before ‘BackupProtocolError’
      [ERROR   ] BackupCommands.cpp:626: error: expected `)' before ‘BackupProtocolError’
      [ERROR   ] BackupCommands.cpp:627: error: no matching function for call to ‘std::auto_ptr<BackupProtocolMessage>::auto_ptr(int*)’
      [ERROR   ] /usr/lib/gcc/x86_64-redhat-linux/4.1.2/../../../../include/c++/4.1.2/memory:349: note: candidates are: std::auto_ptr<_Tp>::auto_ptr(std::auto_ptr_ref<_Tp>) [with _Tp = BackupProtocolMessage]
      [ERROR   ] /usr/lib/gcc/x86_64-redhat-linux/4.1.2/../../../../include/c++/4.1.2/memory:199: note:                 std::auto_ptr<_Tp>::auto_ptr(std::auto_ptr<_Tp>&) [with _Tp = BackupProtocolMessage]
      [ERROR   ] /usr/lib/gcc/x86_64-redhat-linux/4.1.2/../../../../include/c++/4.1.2/memory:190: note:                 std::auto_ptr<_Tp>::auto_ptr(_Tp*) [with _Tp = BackupProtocolMessage]
      [ERROR   ] BackupCommands.cpp:627: error: expected primary-expression before ‘(’ token
      [ERROR   ] BackupCommands.cpp:627: error: expected type-specifier before ‘BackupProtocolError’
      [ERROR   ] BackupCommands.cpp:627: error: expected `)' before ‘BackupProtocolError’
      [ERROR   ] BackupCommands.cpp:630: error: ‘mObjectID’ was not declared in this scope
      [ERROR   ] BackupCommands.cpp:632: error: no matching function for call to ‘std::auto_ptr<BackupProtocolMessage>::auto_ptr(int*)’
      [ERROR   ] /usr/lib/gcc/x86_64-redhat-linux/4.1.2/../../../../include/c++/4.1.2/memory:349: note: candidates are: std::auto_ptr<_Tp>::auto_ptr(std::auto_ptr_ref<_Tp>) [with _Tp = BackupProtocolMessage]
      [ERROR   ] /usr/lib/gcc/x86_64-redhat-linux/4.1.2/../../../../include/c++/4.1.2/memory:199: note:                 std::auto_ptr<_Tp>::auto_ptr(std::auto_ptr<_Tp>&) [with _Tp = BackupProtocolMessage]
      [ERROR   ] /usr/lib/gcc/x86_64-redhat-linux/4.1.2/../../../../include/c++/4.1.2/memory:190: note:                 std::auto_ptr<_Tp>::auto_ptr(_Tp*) [with _Tp = BackupProtocolMessage]
      [ERROR   ] BackupCommands.cpp:632: error: expected primary-expression before ‘(’ token
      [ERROR   ] BackupCommands.cpp:632: error: expected type-specifier before ‘BackupProtocolError’
      [ERROR   ] BackupCommands.cpp:632: error: expected `)' before ‘BackupProtocolError’
      [ERROR   ] BackupCommands.cpp:638: error: ‘mObjectID’ was not declared in this scope
      [ERROR   ] BackupCommands.cpp:644: error: no matching function for call to ‘std::auto_ptr<BackupProtocolMessage>::auto_ptr(int*)’
      [ERROR   ] /usr/lib/gcc/x86_64-redhat-linux/4.1.2/../../../../include/c++/4.1.2/memory:349: note: candidates are: std::auto_ptr<_Tp>::auto_ptr(std::auto_ptr_ref<_Tp>) [with _Tp = BackupProtocolMessage]
      [ERROR   ] /usr/lib/gcc/x86_64-redhat-linux/4.1.2/../../../../include/c++/4.1.2/memory:199: note:                 std::auto_ptr<_Tp>::auto_ptr(std::auto_ptr<_Tp>&) [with _Tp = BackupProtocolMessage]
      [ERROR   ] /usr/lib/gcc/x86_64-redhat-linux/4.1.2/../../../../include/c++/4.1.2/memory:190: note:                 std::auto_ptr<_Tp>::auto_ptr(_Tp*) [with _Tp = BackupProtocolMessage]
      [ERROR   ] BackupCommands.cpp:644: error: expected primary-expression before ‘(’ token
      [ERROR   ] BackupCommands.cpp:644: error: expected type-specifier before ‘BackupProtocolError’
      [ERROR   ] BackupCommands.cpp:644: error: expected `)' before ‘BackupProtocolError’
      [ERROR   ] BackupCommands.cpp:651: error: no matching function for call to ‘std::auto_ptr<BackupProtocolMessage>::auto_ptr(int*)’
      [ERROR   ] /usr/lib/gcc/x86_64-redhat-linux/4.1.2/../../../../include/c++/4.1.2/memory:349: note: candidates are: std::auto_ptr<_Tp>::auto_ptr(std::auto_ptr_ref<_Tp>) [with _Tp = BackupProtocolMessage]
      [ERROR   ] /usr/lib/gcc/x86_64-redhat-linux/4.1.2/../../../../include/c++/4.1.2/memory:199: note:                 std::auto_ptr<_Tp>::auto_ptr(std::auto_ptr<_Tp>&) [with _Tp = BackupProtocolMessage]
      [ERROR   ] /usr/lib/gcc/x86_64-redhat-linux/4.1.2/../../../../include/c++/4.1.2/memory:190: note:                 std::auto_ptr<_Tp>::auto_ptr(_Tp*) [with _Tp = BackupProtocolMessage]
      [ERROR   ] BackupCommands.cpp:651: error: expected primary-expression before ‘(’ token
      [ERROR   ] BackupCommands.cpp:651: error: expected type-specifier before ‘BackupProtocolSuccess’
      [ERROR   ] BackupCommands.cpp:651: error: expected `)' before ‘BackupProtocolSuccess’
      [ERROR   ] BackupCommands.cpp: At global scope:
      [ERROR   ] BackupCommands.cpp:663: error: ‘BackupProtocolUndeleteDirectory’ has not been declared
      [ERROR   ] BackupCommands.cpp:663: error: non-member function ‘std::auto_ptr<BackupProtocolMessage> DoCommand(BackupProtocolReplyable&, BackupStoreContext&)’ cannot have cv-qualifier
      [ERROR   ] BackupCommands.cpp: In function ‘std::auto_ptr<BackupProtocolMessage> DoCommand(BackupProtocolReplyable&, BackupStoreContext&)’:
      [ERROR   ] BackupCommands.cpp:663: error: redefinition of ‘std::auto_ptr<BackupProtocolMessage> DoCommand(BackupProtocolReplyable&, BackupStoreContext&)’
      [ERROR   ] BackupCommands.cpp:58: error: ‘std::auto_ptr<BackupProtocolMessage> DoCommand(BackupProtocolReplyable&, BackupStoreContext&)’ previously defined here
      [ERROR   ] BackupCommands.cpp:665: error: no matching function for call to ‘std::auto_ptr<BackupProtocolMessage>::auto_ptr(int*)’
      [ERROR   ] /usr/lib/gcc/x86_64-redhat-linux/4.1.2/../../../../include/c++/4.1.2/memory:349: note: candidates are: std::auto_ptr<_Tp>::auto_ptr(std::auto_ptr_ref<_Tp>) [with _Tp = BackupProtocolMessage]
      [ERROR   ] /usr/lib/gcc/x86_64-redhat-linux/4.1.2/../../../../include/c++/4.1.2/memory:199: note:                 std::auto_ptr<_Tp>::auto_ptr(std::auto_ptr<_Tp>&) [with _Tp = BackupProtocolMessage]
      [ERROR   ] /usr/lib/gcc/x86_64-redhat-linux/4.1.2/../../../../include/c++/4.1.2/memory:190: note:                 std::auto_ptr<_Tp>::auto_ptr(_Tp*) [with _Tp = BackupProtocolMessage]
      [ERROR   ] BackupCommands.cpp:665: error: expected primary-expression before ‘(’ token
      [ERROR   ] BackupCommands.cpp:665: error: expected type-specifier before ‘BackupProtocolError’
      [ERROR   ] BackupCommands.cpp:665: error: expected `)' before ‘BackupProtocolError’
      [ERROR   ] BackupCommands.cpp:666: error: no matching function for call to ‘std::auto_ptr<BackupProtocolMessage>::auto_ptr(int*)’
      [ERROR   ] /usr/lib/gcc/x86_64-redhat-linux/4.1.2/../../../../include/c++/4.1.2/memory:349: note: candidates are: std::auto_ptr<_Tp>::auto_ptr(std::auto_ptr_ref<_Tp>) [with _Tp = BackupProtocolMessage]
      [ERROR   ] /usr/lib/gcc/x86_64-redhat-linux/4.1.2/../../../../include/c++/4.1.2/memory:199: note:                 std::auto_ptr<_Tp>::auto_ptr(std::auto_ptr<_Tp>&) [with _Tp = BackupProtocolMessage]
      [ERROR   ] /usr/lib/gcc/x86_64-redhat-linux/4.1.2/../../../../include/c++/4.1.2/memory:190: note:                 std::auto_ptr<_Tp>::auto_ptr(_Tp*) [with _Tp = BackupProtocolMessage]
      [ERROR   ] BackupCommands.cpp:666: error: expected primary-expression before ‘(’ token
      [ERROR   ] BackupCommands.cpp:666: error: expected type-specifier before ‘BackupProtocolError’
      [ERROR   ] BackupCommands.cpp:666: error: expected `)' before ‘BackupProtocolError’
      [ERROR   ] BackupCommands.cpp:669: error: ‘mObjectID’ was not declared in this scope
      [ERROR   ] BackupCommands.cpp:671: error: no matching function for call to ‘std::auto_ptr<BackupProtocolMessage>::auto_ptr(int*)’
      [ERROR   ] /usr/lib/gcc/x86_64-redhat-linux/4.1.2/../../../../include/c++/4.1.2/memory:349: note: candidates are: std::auto_ptr<_Tp>::auto_ptr(std::auto_ptr_ref<_Tp>) [with _Tp = BackupProtocolMessage]
      [ERROR   ] /usr/lib/gcc/x86_64-redhat-linux/4.1.2/../../../../include/c++/4.1.2/memory:199: note:                 std::auto_ptr<_Tp>::auto_ptr(std::auto_ptr<_Tp>&) [with _Tp = BackupProtocolMessage]
      [ERROR   ] /usr/lib/gcc/x86_64-redhat-linux/4.1.2/../../../../include/c++/4.1.2/memory:190: note:                 std::auto_ptr<_Tp>::auto_ptr(_Tp*) [with _Tp = BackupProtocolMessage]
      [ERROR   ] BackupCommands.cpp:671: error: expected primary-expression before ‘(’ token
      [ERROR   ] BackupCommands.cpp:671: error: expected type-specifier before ‘BackupProtocolError’
      [ERROR   ] BackupCommands.cpp:671: error: expected `)' before ‘BackupProtocolError’
      [ERROR   ] BackupCommands.cpp:675: error: ‘mObjectID’ was not declared in this scope
      [ERROR   ] BackupCommands.cpp:678: error: no matching function for call to ‘std::auto_ptr<BackupProtocolMessage>::auto_ptr(int*)’
      [ERROR   ] /usr/lib/gcc/x86_64-redhat-linux/4.1.2/../../../../include/c++/4.1.2/memory:349: note: candidates are: std::auto_ptr<_Tp>::auto_ptr(std::auto_ptr_ref<_Tp>) [with _Tp = BackupProtocolMessage]
      [ERROR   ] /usr/lib/gcc/x86_64-redhat-linux/4.1.2/../../../../include/c++/4.1.2/memory:199: note:                 std::auto_ptr<_Tp>::auto_ptr(std::auto_ptr<_Tp>&) [with _Tp = BackupProtocolMessage]
      [ERROR   ] /usr/lib/gcc/x86_64-redhat-linux/4.1.2/../../../../include/c++/4.1.2/memory:190: note:                 std::auto_ptr<_Tp>::auto_ptr(_Tp*) [with _Tp = BackupProtocolMessage]
      [ERROR   ] BackupCommands.cpp:678: error: expected primary-expression before ‘(’ token
      [ERROR   ] BackupCommands.cpp:678: error: expected type-specifier before ‘BackupProtocolSuccess’
      [ERROR   ] BackupCommands.cpp:678: error: expected `)' before ‘BackupProtocolSuccess’
      [ERROR   ] BackupCommands.cpp: At global scope:
      [ERROR   ] BackupCommands.cpp:689: error: ‘BackupProtocolSetClientStoreMarker’ has not been declared
      [ERROR   ] BackupCommands.cpp:689: error: non-member function ‘std::auto_ptr<BackupProtocolMessage> DoCommand(BackupProtocolReplyable&, BackupStoreContext&)’ cannot have cv-qualifier
      [ERROR   ] BackupCommands.cpp: In function ‘std::auto_ptr<BackupProtocolMessage> DoCommand(BackupProtocolReplyable&, BackupStoreContext&)’:
      [ERROR   ] BackupCommands.cpp:689: error: redefinition of ‘std::auto_ptr<BackupProtocolMessage> DoCommand(BackupProtocolReplyable&, BackupStoreContext&)’
      [ERROR   ] BackupCommands.cpp:58: error: ‘std::auto_ptr<BackupProtocolMessage> DoCommand(BackupProtocolReplyable&, BackupStoreContext&)’ previously defined here
      [ERROR   ] BackupCommands.cpp:691: error: no matching function for call to ‘std::auto_ptr<BackupProtocolMessage>::auto_ptr(int*)’
      [ERROR   ] /usr/lib/gcc/x86_64-redhat-linux/4.1.2/../../../../include/c++/4.1.2/memory:349: note: candidates are: std::auto_ptr<_Tp>::auto_ptr(std::auto_ptr_ref<_Tp>) [with _Tp = BackupProtocolMessage]
      [ERROR   ] /usr/lib/gcc/x86_64-redhat-linux/4.1.2/../../../../include/c++/4.1.2/memory:199: note:                 std::auto_ptr<_Tp>::auto_ptr(std::auto_ptr<_Tp>&) [with _Tp = BackupProtocolMessage]
      [ERROR   ] /usr/lib/gcc/x86_64-redhat-linux/4.1.2/../../../../include/c++/4.1.2/memory:190: note:                 std::auto_ptr<_Tp>::auto_ptr(_Tp*) [with _Tp = BackupProtocolMessage]
      [ERROR   ] BackupCommands.cpp:691: error: expected primary-expression before ‘(’ token
      [ERROR   ] BackupCommands.cpp:691: error: expected type-specifier before ‘BackupProtocolError’
      [ERROR   ] BackupCommands.cpp:691: error: expected `)' before ‘BackupProtocolError’
      [ERROR   ] BackupCommands.cpp:692: error: no matching function for call to ‘std::auto_ptr<BackupProtocolMessage>::auto_ptr(int*)’
      [ERROR   ] /usr/lib/gcc/x86_64-redhat-linux/4.1.2/../../../../include/c++/4.1.2/memory:349: note: candidates are: std::auto_ptr<_Tp>::auto_ptr(std::auto_ptr_ref<_Tp>) [with _Tp = BackupProtocolMessage]
      [ERROR   ] /usr/lib/gcc/x86_64-redhat-linux/4.1.2/../../../../include/c++/4.1.2/memory:199: note:                 std::auto_ptr<_Tp>::auto_ptr(std::auto_ptr<_Tp>&) [with _Tp = BackupProtocolMessage]
      [ERROR   ] /usr/lib/gcc/x86_64-redhat-linux/4.1.2/../../../../include/c++/4.1.2/memory:190: note:                 std::auto_ptr<_Tp>::auto_ptr(_Tp*) [with _Tp = BackupProtocolMessage]
      [ERROR   ] BackupCommands.cpp:692: error: expected primary-expression before ‘(’ token
      [ERROR   ] BackupCommands.cpp:692: error: expected type-specifier before ‘BackupProtocolError’
      [ERROR   ] BackupCommands.cpp:692: error: expected `)' before ‘BackupProtocolError’
      [ERROR   ] BackupCommands.cpp:695: error: ‘mClientStoreMarker’ was not declared in this scope
      [ERROR   ] BackupCommands.cpp:698: error: no matching function for call to ‘std::auto_ptr<BackupProtocolMessage>::auto_ptr(int*)’
      [ERROR   ] /usr/lib/gcc/x86_64-redhat-linux/4.1.2/../../../../include/c++/4.1.2/memory:349: note: candidates are: std::auto_ptr<_Tp>::auto_ptr(std::auto_ptr_ref<_Tp>) [with _Tp = BackupProtocolMessage]
      [ERROR   ] /usr/lib/gcc/x86_64-redhat-linux/4.1.2/../../../../include/c++/4.1.2/memory:199: note:                 std::auto_ptr<_Tp>::auto_ptr(std::auto_ptr<_Tp>&) [with _Tp = BackupProtocolMessage]
      [ERROR   ] /usr/lib/gcc/x86_64-redhat-linux/4.1.2/../../../../include/c++/4.1.2/memory:190: note:                 std::auto_ptr<_Tp>::auto_ptr(_Tp*) [with _Tp = BackupProtocolMessage]
      [ERROR   ] BackupCommands.cpp:698: error: expected primary-expression before ‘(’ token
      [ERROR   ] BackupCommands.cpp:698: error: expected type-specifier before ‘BackupProtocolSuccess’
      [ERROR   ] BackupCommands.cpp:698: error: expected `)' before ‘BackupProtocolSuccess’
      [ERROR   ] BackupCommands.cpp: At global scope:
      [ERROR   ] BackupCommands.cpp:710: error: ‘BackupProtocolMoveObject’ has not been declared
      [ERROR   ] BackupCommands.cpp:710: error: non-member function ‘std::auto_ptr<BackupProtocolMessage> DoCommand(BackupProtocolReplyable&, BackupStoreContext&)’ cannot have cv-qualifier
      [ERROR   ] BackupCommands.cpp: In function ‘std::auto_ptr<BackupProtocolMessage> DoCommand(BackupProtocolReplyable&, BackupStoreContext&)’:
      [ERROR   ] BackupCommands.cpp:710: error: redefinition of ‘std::auto_ptr<BackupProtocolMessage> DoCommand(BackupProtocolReplyable&, BackupStoreContext&)’
      [ERROR   ] BackupCommands.cpp:58: error: ‘std::auto_ptr<BackupProtocolMessage> DoCommand(BackupProtocolReplyable&, BackupStoreContext&)’ previously defined here
      [ERROR   ] BackupCommands.cpp:712: error: no matching function for call to ‘std::auto_ptr<BackupProtocolMessage>::auto_ptr(int*)’
      [ERROR   ] /usr/lib/gcc/x86_64-redhat-linux/4.1.2/../../../../include/c++/4.1.2/memory:349: note: candidates are: std::auto_ptr<_Tp>::auto_ptr(std::auto_ptr_ref<_Tp>) [with _Tp = BackupProtocolMessage]
      [ERROR   ] /usr/lib/gcc/x86_64-redhat-linux/4.1.2/../../../../include/c++/4.1.2/memory:199: note:                 std::auto_ptr<_Tp>::auto_ptr(std::auto_ptr<_Tp>&) [with _Tp = BackupProtocolMessage]
      [ERROR   ] /usr/lib/gcc/x86_64-redhat-linux/4.1.2/../../../../include/c++/4.1.2/memory:190: note:                 std::auto_ptr<_Tp>::auto_ptr(_Tp*) [with _Tp = BackupProtocolMessage]
      [ERROR   ] BackupCommands.cpp:712: error: expected primary-expression before ‘(’ token
      [ERROR   ] BackupCommands.cpp:712: error: expected type-specifier before ‘BackupProtocolError’
      [ERROR   ] BackupCommands.cpp:712: error: expected `)' before ‘BackupProtocolError’
      [ERROR   ] BackupCommands.cpp:713: error: no matching function for call to ‘std::auto_ptr<BackupProtocolMessage>::auto_ptr(int*)’
      [ERROR   ] /usr/lib/gcc/x86_64-redhat-linux/4.1.2/../../../../include/c++/4.1.2/memory:349: note: candidates are: std::auto_ptr<_Tp>::auto_ptr(std::auto_ptr_ref<_Tp>) [with _Tp = BackupProtocolMessage]
      [ERROR   ] /usr/lib/gcc/x86_64-redhat-linux/4.1.2/../../../../include/c++/4.1.2/memory:199: note:                 std::auto_ptr<_Tp>::auto_ptr(std::auto_ptr<_Tp>&) [with _Tp = BackupProtocolMessage]
      [ERROR   ] /usr/lib/gcc/x86_64-redhat-linux/4.1.2/../../../../include/c++/4.1.2/memory:190: note:                 std::auto_ptr<_Tp>::auto_ptr(_Tp*) [with _Tp = BackupProtocolMessage]
      [ERROR   ] BackupCommands.cpp:713: error: expected primary-expression before ‘(’ token
      [ERROR   ] BackupCommands.cpp:713: error: expected type-specifier before ‘BackupProtocolError’
      [ERROR   ] BackupCommands.cpp:713: error: expected `)' before ‘BackupProtocolError’
      [ERROR   ] BackupCommands.cpp:718: error: ‘mObjectID’ was not declared in this scope
      [ERROR   ] BackupCommands.cpp:718: error: ‘mMoveFromDirectory’ was not declared in this scope
      [ERROR   ] BackupCommands.cpp:718: error: ‘mMoveToDirectory’ was not declared in this scope
      [ERROR   ] BackupCommands.cpp:719: error: ‘mNewFilename’ was not declared in this scope
      [ERROR   ] BackupCommands.cpp:719: error: ‘mFlags’ was not declared in this scope
      [ERROR   ] BackupCommands.cpp:719: error: ‘Flags_MoveAllWithSameName’ was not declared in this scope
      [ERROR   ] BackupCommands.cpp:720: error: ‘Flags_AllowMoveOverDeletedObject’ was not declared in this scope
      [ERROR   ] BackupCommands.cpp:726: error: no matching function for call to ‘std::auto_ptr<BackupProtocolMessage>::auto_ptr(int*)’
      [ERROR   ] /usr/lib/gcc/x86_64-redhat-linux/4.1.2/../../../../include/c++/4.1.2/memory:349: note: candidates are: std::auto_ptr<_Tp>::auto_ptr(std::auto_ptr_ref<_Tp>) [with _Tp = BackupProtocolMessage]
      [ERROR   ] /usr/lib/gcc/x86_64-redhat-linux/4.1.2/../../../../include/c++/4.1.2/memory:199: note:                 std::auto_ptr<_Tp>::auto_ptr(std::auto_ptr<_Tp>&) [with _Tp = BackupProtocolMessage]
      [ERROR   ] /usr/lib/gcc/x86_64-redhat-linux/4.1.2/../../../../include/c++/4.1.2/memory:190: note:                 std::auto_ptr<_Tp>::auto_ptr(_Tp*) [with _Tp = BackupProtocolMessage]
      [ERROR   ] BackupCommands.cpp:726: error: expected primary-expression before ‘(’ token
      [ERROR   ] BackupCommands.cpp:726: error: expected type-specifier before ‘BackupProtocolError’
      [ERROR   ] BackupCommands.cpp:726: error: expected `)' before ‘BackupProtocolError’
      [ERROR   ] BackupCommands.cpp:730: error: no matching function for call to ‘std::auto_ptr<BackupProtocolMessage>::auto_ptr(int*)’
      [ERROR   ] /usr/lib/gcc/x86_64-redhat-linux/4.1.2/../../../../include/c++/4.1.2/memory:349: note: candidates are: std::auto_ptr<_Tp>::auto_ptr(std::auto_ptr_ref<_Tp>) [with _Tp = BackupProtocolMessage]
      [ERROR   ] /usr/lib/gcc/x86_64-redhat-linux/4.1.2/../../../../include/c++/4.1.2/memory:199: note:                 std::auto_ptr<_Tp>::auto_ptr(std::auto_ptr<_Tp>&) [with _Tp = BackupProtocolMessage]
      [ERROR   ] /usr/lib/gcc/x86_64-redhat-linux/4.1.2/../../../../include/c++/4.1.2/memory:190: note:                 std::auto_ptr<_Tp>::auto_ptr(_Tp*) [with _Tp = BackupProtocolMessage]
      [ERROR   ] BackupCommands.cpp:730: error: expected primary-expression before ‘(’ token
      [ERROR   ] BackupCommands.cpp:730: error: expected type-specifier before ‘BackupProtocolError’
      [ERROR   ] BackupCommands.cpp:730: error: expected `)' before ‘BackupProtocolError’
      [ERROR   ] BackupCommands.cpp:739: error: no matching function for call to ‘std::auto_ptr<BackupProtocolMessage>::auto_ptr(int*)’
      [ERROR   ] /usr/lib/gcc/x86_64-redhat-linux/4.1.2/../../../../include/c++/4.1.2/memory:349: note: candidates are: std::auto_ptr<_Tp>::auto_ptr(std::auto_ptr_ref<_Tp>) [with _Tp = BackupProtocolMessage]
      [ERROR   ] /usr/lib/gcc/x86_64-redhat-linux/4.1.2/../../../../include/c++/4.1.2/memory:199: note:                 std::auto_ptr<_Tp>::auto_ptr(std::auto_ptr<_Tp>&) [with _Tp = BackupProtocolMessage]
      [ERROR   ] /usr/lib/gcc/x86_64-redhat-linux/4.1.2/../../../../include/c++/4.1.2/memory:190: note:                 std::auto_ptr<_Tp>::auto_ptr(_Tp*) [with _Tp = BackupProtocolMessage]
      [ERROR   ] BackupCommands.cpp:739: error: expected primary-expression before ‘(’ token
      [ERROR   ] BackupCommands.cpp:739: error: expected type-specifier before ‘BackupProtocolSuccess’
      [ERROR   ] BackupCommands.cpp:739: error: expected `)' before ‘BackupProtocolSuccess’
      [ERROR   ] BackupCommands.cpp: At global scope:
      [ERROR   ] BackupCommands.cpp:751: error: ‘BackupProtocolGetObjectName’ has not been declared
      [ERROR   ] BackupCommands.cpp:751: error: non-member function ‘std::auto_ptr<BackupProtocolMessage> DoCommand(BackupProtocolReplyable&, BackupStoreContext&)’ cannot have cv-qualifier
      [ERROR   ] BackupCommands.cpp: In function ‘std::auto_ptr<BackupProtocolMessage> DoCommand(BackupProtocolReplyable&, BackupStoreContext&)’:
      [ERROR   ] BackupCommands.cpp:751: error: redefinition of ‘std::auto_ptr<BackupProtocolMessage> DoCommand(BackupProtocolReplyable&, BackupStoreContext&)’
      [ERROR   ] BackupCommands.cpp:58: error: ‘std::auto_ptr<BackupProtocolMessage> DoCommand(BackupProtocolReplyable&, BackupStoreContext&)’ previously defined here
      [ERROR   ] BackupCommands.cpp:753: error: no matching function for call to ‘std::auto_ptr<BackupProtocolMessage>::auto_ptr(int*)’
      [ERROR   ] /usr/lib/gcc/x86_64-redhat-linux/4.1.2/../../../../include/c++/4.1.2/memory:349: note: candidates are: std::auto_ptr<_Tp>::auto_ptr(std::auto_ptr_ref<_Tp>) [with _Tp = BackupProtocolMessage]
      [ERROR   ] /usr/lib/gcc/x86_64-redhat-linux/4.1.2/../../../../include/c++/4.1.2/memory:199: note:                 std::auto_ptr<_Tp>::auto_ptr(std::auto_ptr<_Tp>&) [with _Tp = BackupProtocolMessage]
      [ERROR   ] /usr/lib/gcc/x86_64-redhat-linux/4.1.2/../../../../include/c++/4.1.2/memory:190: note:                 std::auto_ptr<_Tp>::auto_ptr(_Tp*) [with _Tp = BackupProtocolMessage]
      [ERROR   ] BackupCommands.cpp:753: error: expected primary-expression before ‘(’ token
      [ERROR   ] BackupCommands.cpp:753: error: expected type-specifier before ‘BackupProtocolError’
      [ERROR   ] BackupCommands.cpp:753: error: expected `)' before ‘BackupProtocolError’
      [ERROR   ] BackupCommands.cpp:759: error: ‘mObjectID’ was not declared in this scope
      [ERROR   ] BackupCommands.cpp:760: error: ‘mContainingDirectoryID’ was not declared in this scope
      [ERROR   ] BackupCommands.cpp:774: error: no matching function for call to ‘std::auto_ptr<BackupProtocolMessage>::auto_ptr(int*)’
      [ERROR   ] /usr/lib/gcc/x86_64-redhat-linux/4.1.2/../../../../include/c++/4.1.2/memory:349: note: candidates are: std::auto_ptr<_Tp>::auto_ptr(std::auto_ptr_ref<_Tp>) [with _Tp = BackupProtocolMessage]
      [ERROR   ] /usr/lib/gcc/x86_64-redhat-linux/4.1.2/../../../../include/c++/4.1.2/memory:199: note:                 std::auto_ptr<_Tp>::auto_ptr(std::auto_ptr<_Tp>&) [with _Tp = BackupProtocolMessage]
      [ERROR   ] /usr/lib/gcc/x86_64-redhat-linux/4.1.2/../../../../include/c++/4.1.2/memory:190: note:                 std::auto_ptr<_Tp>::auto_ptr(_Tp*) [with _Tp = BackupProtocolMessage]
      [ERROR   ] BackupCommands.cpp:774: error: expected primary-expression before ‘(’ token
      [ERROR   ] BackupCommands.cpp:774: error: expected type-specifier before ‘BackupProtocolObjectName’
      [ERROR   ] BackupCommands.cpp:774: error: expected `)' before ‘BackupProtocolObjectName’
      [ERROR   ] BackupCommands.cpp:781: error: ‘ObjectID_DirectoryOnly’ was not declared in this scope
      [ERROR   ] BackupCommands.cpp:789: error: no matching function for call to ‘std::auto_ptr<BackupProtocolMessage>::auto_ptr(int*)’
      [ERROR   ] /usr/lib/gcc/x86_64-redhat-linux/4.1.2/../../../../include/c++/4.1.2/memory:349: note: candidates are: std::auto_ptr<_Tp>::auto_ptr(std::auto_ptr_ref<_Tp>) [with _Tp = BackupProtocolMessage]
      [ERROR   ] /usr/lib/gcc/x86_64-redhat-linux/4.1.2/../../../../include/c++/4.1.2/memory:199: note:                 std::auto_ptr<_Tp>::auto_ptr(std::auto_ptr<_Tp>&) [with _Tp = BackupProtocolMessage]
      [ERROR   ] /usr/lib/gcc/x86_64-redhat-linux/4.1.2/../../../../include/c++/4.1.2/memory:190: note:                 std::auto_ptr<_Tp>::auto_ptr(_Tp*) [with _Tp = BackupProtocolMessage]
      [ERROR   ] BackupCommands.cpp:789: error: expected primary-expression before ‘(’ token
      [ERROR   ] BackupCommands.cpp:789: error: expected type-specifier before ‘BackupProtocolObjectName’
      [ERROR   ] BackupCommands.cpp:789: error: expected `)' before ‘BackupProtocolObjectName’
      [ERROR   ] BackupCommands.cpp:829: error: no matching function for call to ‘std::auto_ptr<BackupProtocolMessage>::auto_ptr(int*)’
      [ERROR   ] /usr/lib/gcc/x86_64-redhat-linux/4.1.2/../../../../include/c++/4.1.2/memory:349: note: candidates are: std::auto_ptr<_Tp>::auto_ptr(std::auto_ptr_ref<_Tp>) [with _Tp = BackupProtocolMessage]
      [ERROR   ] /usr/lib/gcc/x86_64-redhat-linux/4.1.2/../../../../include/c++/4.1.2/memory:199: note:                 std::auto_ptr<_Tp>::auto_ptr(std::auto_ptr<_Tp>&) [with _Tp = BackupProtocolMessage]
      [ERROR   ] /usr/lib/gcc/x86_64-redhat-linux/4.1.2/../../../../include/c++/4.1.2/memory:190: note:                 std::auto_ptr<_Tp>::auto_ptr(_Tp*) [with _Tp = BackupProtocolMessage]
      [ERROR   ] BackupCommands.cpp:829: error: expected primary-expression before ‘(’ token
      [ERROR   ] BackupCommands.cpp:829: error: expected type-specifier before ‘BackupProtocolObjectName’
      [ERROR   ] BackupCommands.cpp:829: error: expected `)' before ‘BackupProtocolObjectName’
      [ERROR   ] BackupCommands.cpp: At global scope:
      [ERROR   ] BackupCommands.cpp:842: error: ‘BackupProtocolGetBlockIndexByID’ has not been declared
      [ERROR   ] BackupCommands.cpp:842: error: non-member function ‘std::auto_ptr<BackupProtocolMessage> DoCommand(BackupProtocolReplyable&, BackupStoreContext&)’ cannot have cv-qualifier
      [ERROR   ] BackupCommands.cpp: In function ‘std::auto_ptr<BackupProtocolMessage> DoCommand(BackupProtocolReplyable&, BackupStoreContext&)’:
      [ERROR   ] BackupCommands.cpp:842: error: redefinition of ‘std::auto_ptr<BackupProtocolMessage> DoCommand(BackupProtocolReplyable&, BackupStoreContext&)’
      [ERROR   ] BackupCommands.cpp:58: error: ‘std::auto_ptr<BackupProtocolMessage> DoCommand(BackupProtocolReplyable&, BackupStoreContext&)’ previously defined here
      [ERROR   ] BackupCommands.cpp:844: error: no matching function for call to ‘std::auto_ptr<BackupProtocolMessage>::auto_ptr(int*)’
      [ERROR   ] /usr/lib/gcc/x86_64-redhat-linux/4.1.2/../../../../include/c++/4.1.2/memory:349: note: candidates are: std::auto_ptr<_Tp>::auto_ptr(std::auto_ptr_ref<_Tp>) [with _Tp = BackupProtocolMessage]
      [ERROR   ] /usr/lib/gcc/x86_64-redhat-linux/4.1.2/../../../../include/c++/4.1.2/memory:199: note:                 std::auto_ptr<_Tp>::auto_ptr(std::auto_ptr<_Tp>&) [with _Tp = BackupProtocolMessage]
      [ERROR   ] /usr/lib/gcc/x86_64-redhat-linux/4.1.2/../../../../include/c++/4.1.2/memory:190: note:                 std::auto_ptr<_Tp>::auto_ptr(_Tp*) [with _Tp = BackupProtocolMessage]
      [ERROR   ] BackupCommands.cpp:844: error: expected primary-expression before ‘(’ token
      [ERROR   ] BackupCommands.cpp:844: error: expected type-specifier before ‘BackupProtocolError’
      [ERROR   ] BackupCommands.cpp:844: error: expected `)' before ‘BackupProtocolError’
      [ERROR   ] BackupCommands.cpp:847: error: ‘mObjectID’ was not declared in this scope
      [ERROR   ] BackupCommands.cpp:856: error: no matching function for call to ‘std::auto_ptr<BackupProtocolMessage>::auto_ptr(int*)’
      [ERROR   ] /usr/lib/gcc/x86_64-redhat-linux/4.1.2/../../../../include/c++/4.1.2/memory:349: note: candidates are: std::auto_ptr<_Tp>::auto_ptr(std::auto_ptr_ref<_Tp>) [with _Tp = BackupProtocolMessage]
      [ERROR   ] /usr/lib/gcc/x86_64-redhat-linux/4.1.2/../../../../include/c++/4.1.2/memory:199: note:                 std::auto_ptr<_Tp>::auto_ptr(std::auto_ptr<_Tp>&) [with _Tp = BackupProtocolMessage]
      [ERROR   ] /usr/lib/gcc/x86_64-redhat-linux/4.1.2/../../../../include/c++/4.1.2/memory:190: note:                 std::auto_ptr<_Tp>::auto_ptr(_Tp*) [with _Tp = BackupProtocolMessage]
      [ERROR   ] BackupCommands.cpp:856: error: expected primary-expression before ‘(’ token
      [ERROR   ] BackupCommands.cpp:856: error: expected type-specifier before ‘BackupProtocolSuccess’
      [ERROR   ] BackupCommands.cpp:856: error: expected `)' before ‘BackupProtocolSuccess’
      [ERROR   ] BackupCommands.cpp: At global scope:
      [ERROR   ] BackupCommands.cpp:868: error: ‘BackupProtocolGetBlockIndexByName’ has not been declared
      [ERROR   ] BackupCommands.cpp:868: error: non-member function ‘std::auto_ptr<BackupProtocolMessage> DoCommand(BackupProtocolReplyable&, BackupStoreContext&)’ cannot have cv-qualifier
      [ERROR   ] BackupCommands.cpp: In function ‘std::auto_ptr<BackupProtocolMessage> DoCommand(BackupProtocolReplyable&, BackupStoreContext&)’:
      [ERROR   ] BackupCommands.cpp:868: error: redefinition of ‘std::auto_ptr<BackupProtocolMessage> DoCommand(BackupProtocolReplyable&, BackupStoreContext&)’
      [ERROR   ] BackupCommands.cpp:58: error: ‘std::auto_ptr<BackupProtocolMessage> DoCommand(BackupProtocolReplyable&, BackupStoreContext&)’ previously defined here
      [ERROR   ] BackupCommands.cpp:870: error: no matching function for call to ‘std::auto_ptr<BackupProtocolMessage>::auto_ptr(int*)’
      [ERROR   ] /usr/lib/gcc/x86_64-redhat-linux/4.1.2/../../../../include/c++/4.1.2/memory:349: note: candidates are: std::auto_ptr<_Tp>::auto_ptr(std::auto_ptr_ref<_Tp>) [with _Tp = BackupProtocolMessage]
      [ERROR   ] /usr/lib/gcc/x86_64-redhat-linux/4.1.2/../../../../include/c++/4.1.2/memory:199: note:                 std::auto_ptr<_Tp>::auto_ptr(std::auto_ptr<_Tp>&) [with _Tp = BackupProtocolMessage]
      [ERROR   ] /usr/lib/gcc/x86_64-redhat-linux/4.1.2/../../../../include/c++/4.1.2/memory:190: note:                 std::auto_ptr<_Tp>::auto_ptr(_Tp*) [with _Tp = BackupProtocolMessage]
      [ERROR   ] BackupCommands.cpp:870: error: expected primary-expression before ‘(’ token
      [ERROR   ] BackupCommands.cpp:870: error: expected type-specifier before ‘BackupProtocolError’
      [ERROR   ] BackupCommands.cpp:870: error: expected `)' before ‘BackupProtocolError’
      [ERROR   ] BackupCommands.cpp:873: error: ‘mInDirectory’ was not declared in this scope
      [ERROR   ] BackupCommands.cpp:881: error: ‘mFilename’ was not declared in this scope
      [ERROR   ] BackupCommands.cpp:895: error: no matching function for call to ‘std::auto_ptr<BackupProtocolMessage>::auto_ptr(int*)’
      [ERROR   ] /usr/lib/gcc/x86_64-redhat-linux/4.1.2/../../../../include/c++/4.1.2/memory:349: note: candidates are: std::auto_ptr<_Tp>::auto_ptr(std::auto_ptr_ref<_Tp>) [with _Tp = BackupProtocolMessage]
      [ERROR   ] /usr/lib/gcc/x86_64-redhat-linux/4.1.2/../../../../include/c++/4.1.2/memory:199: note:                 std::auto_ptr<_Tp>::auto_ptr(std::auto_ptr<_Tp>&) [with _Tp = BackupProtocolMessage]
      [ERROR   ] /usr/lib/gcc/x86_64-redhat-linux/4.1.2/../../../../include/c++/4.1.2/memory:190: note:                 std::auto_ptr<_Tp>::auto_ptr(_Tp*) [with _Tp = BackupProtocolMessage]
      [ERROR   ] BackupCommands.cpp:895: error: expected primary-expression before ‘(’ token
      [ERROR   ] BackupCommands.cpp:895: error: expected type-specifier before ‘BackupProtocolSuccess’
      [ERROR   ] BackupCommands.cpp:895: error: expected `)' before ‘BackupProtocolSuccess’
      [ERROR   ] BackupCommands.cpp:908: error: no matching function for call to ‘std::auto_ptr<BackupProtocolMessage>::auto_ptr(int*)’
      [ERROR   ] /usr/lib/gcc/x86_64-redhat-linux/4.1.2/../../../../include/c++/4.1.2/memory:349: note: candidates are: std::auto_ptr<_Tp>::auto_ptr(std::auto_ptr_ref<_Tp>) [with _Tp = BackupProtocolMessage]
      [ERROR   ] /usr/lib/gcc/x86_64-redhat-linux/4.1.2/../../../../include/c++/4.1.2/memory:199: note:                 std::auto_ptr<_Tp>::auto_ptr(std::auto_ptr<_Tp>&) [with _Tp = BackupProtocolMessage]
      [ERROR   ] /usr/lib/gcc/x86_64-redhat-linux/4.1.2/../../../../include/c++/4.1.2/memory:190: note:                 std::auto_ptr<_Tp>::auto_ptr(_Tp*) [with _Tp = BackupProtocolMessage]
      [ERROR   ] BackupCommands.cpp:908: error: expected primary-expression before ‘(’ token
      [ERROR   ] BackupCommands.cpp:908: error: expected type-specifier before ‘BackupProtocolSuccess’
      [ERROR   ] BackupCommands.cpp:908: error: expected `)' before ‘BackupProtocolSuccess’
      [ERROR   ] BackupCommands.cpp: At global scope:
      [ERROR   ] BackupCommands.cpp:920: error: ‘BackupProtocolGetAccountUsage’ has not been declared
      [ERROR   ] BackupCommands.cpp:920: error: non-member function ‘std::auto_ptr<BackupProtocolMessage> DoCommand(BackupProtocolReplyable&, BackupStoreContext&)’ cannot have cv-qualifier
      [ERROR   ] BackupCommands.cpp: In function ‘std::auto_ptr<BackupProtocolMessage> DoCommand(BackupProtocolReplyable&, BackupStoreContext&)’:
      [ERROR   ] BackupCommands.cpp:920: error: redefinition of ‘std::auto_ptr<BackupProtocolMessage> DoCommand(BackupProtocolReplyable&, BackupStoreContext&)’
      [ERROR   ] BackupCommands.cpp:58: error: ‘std::auto_ptr<BackupProtocolMessage> DoCommand(BackupProtocolReplyable&, BackupStoreContext&)’ previously defined here
      [ERROR   ] BackupCommands.cpp:922: error: no matching function for call to ‘std::auto_ptr<BackupProtocolMessage>::auto_ptr(int*)’
      [ERROR   ] /usr/lib/gcc/x86_64-redhat-linux/4.1.2/../../../../include/c++/4.1.2/memory:349: note: candidates are: std::auto_ptr<_Tp>::auto_ptr(std::auto_ptr_ref<_Tp>) [with _Tp = BackupProtocolMessage]
      [ERROR   ] /usr/lib/gcc/x86_64-redhat-linux/4.1.2/../../../../include/c++/4.1.2/memory:199: note:                 std::auto_ptr<_Tp>::auto_ptr(std::auto_ptr<_Tp>&) [with _Tp = BackupProtocolMessage]
      [ERROR   ] /usr/lib/gcc/x86_64-redhat-linux/4.1.2/../../../../include/c++/4.1.2/memory:190: note:                 std::auto_ptr<_Tp>::auto_ptr(_Tp*) [with _Tp = BackupProtocolMessage]
      [ERROR   ] BackupCommands.cpp:922: error: expected primary-expression before ‘(’ token
      [ERROR   ] BackupCommands.cpp:922: error: expected type-specifier before ‘BackupProtocolError’
      [ERROR   ] BackupCommands.cpp:922: error: expected `)' before ‘BackupProtocolError’
      [ERROR   ] BackupCommands.cpp:940: error: no matching function for call to ‘std::auto_ptr<BackupProtocolMessage>::auto_ptr(int*)’
      [ERROR   ] /usr/lib/gcc/x86_64-redhat-linux/4.1.2/../../../../include/c++/4.1.2/memory:349: note: candidates are: std::auto_ptr<_Tp>::auto_ptr(std::auto_ptr_ref<_Tp>) [with _Tp = BackupProtocolMessage]
      [ERROR   ] /usr/lib/gcc/x86_64-redhat-linux/4.1.2/../../../../include/c++/4.1.2/memory:199: note:                 std::auto_ptr<_Tp>::auto_ptr(std::auto_ptr<_Tp>&) [with _Tp = BackupProtocolMessage]
      [ERROR   ] /usr/lib/gcc/x86_64-redhat-linux/4.1.2/../../../../include/c++/4.1.2/memory:190: note:                 std::auto_ptr<_Tp>::auto_ptr(_Tp*) [with _Tp = BackupProtocolMessage]
      [ERROR   ] BackupCommands.cpp:932: error: expected primary-expression before ‘(’ token
      [ERROR   ] BackupCommands.cpp:932: error: expected type-specifier before ‘BackupProtocolAccountUsage’
      [ERROR   ] BackupCommands.cpp:932: error: expected `)' before ‘BackupProtocolAccountUsage’
      [ERROR   ] BackupCommands.cpp:929: warning: unused variable ‘rdiscSet’
      [ERROR   ] BackupCommands.cpp: At global scope:
      [ERROR   ] BackupCommands.cpp:951: error: ‘BackupProtocolGetIsAlive’ has not been declared
      [ERROR   ] BackupCommands.cpp:951: error: non-member function ‘std::auto_ptr<BackupProtocolMessage> DoCommand(BackupProtocolReplyable&, BackupStoreContext&)’ cannot have cv-qualifier
      [ERROR   ] BackupCommands.cpp: In function ‘std::auto_ptr<BackupProtocolMessage> DoCommand(BackupProtocolReplyable&, BackupStoreContext&)’:
      [ERROR   ] BackupCommands.cpp:951: error: redefinition of ‘std::auto_ptr<BackupProtocolMessage> DoCommand(BackupProtocolReplyable&, BackupStoreContext&)’
      [ERROR   ] BackupCommands.cpp:58: error: ‘std::auto_ptr<BackupProtocolMessage> DoCommand(BackupProtocolReplyable&, BackupStoreContext&)’ previously defined here
      [ERROR   ] BackupCommands.cpp:953: error: no matching function for call to ‘std::auto_ptr<BackupProtocolMessage>::auto_ptr(int*)’
      [ERROR   ] /usr/lib/gcc/x86_64-redhat-linux/4.1.2/../../../../include/c++/4.1.2/memory:349: note: candidates are: std::auto_ptr<_Tp>::auto_ptr(std::auto_ptr_ref<_Tp>) [with _Tp = BackupProtocolMessage]
      [ERROR   ] /usr/lib/gcc/x86_64-redhat-linux/4.1.2/../../../../include/c++/4.1.2/memory:199: note:                 std::auto_ptr<_Tp>::auto_ptr(std::auto_ptr<_Tp>&) [with _Tp = BackupProtocolMessage]
      [ERROR   ] /usr/lib/gcc/x86_64-redhat-linux/4.1.2/../../../../include/c++/4.1.2/memory:190: note:                 std::auto_ptr<_Tp>::auto_ptr(_Tp*) [with _Tp = BackupProtocolMessage]
      [ERROR   ] BackupCommands.cpp:953: error: expected primary-expression before ‘(’ token
      [ERROR   ] BackupCommands.cpp:953: error: expected type-specifier before ‘BackupProtocolError’
      [ERROR   ] BackupCommands.cpp:953: error: expected `)' before ‘BackupProtocolError’
      [ERROR   ] BackupCommands.cpp:958: error: no matching function for call to ‘std::auto_ptr<BackupProtocolMessage>::auto_ptr(int*)’
      [ERROR   ] /usr/lib/gcc/x86_64-redhat-linux/4.1.2/../../../../include/c++/4.1.2/memory:349: note: candidates are: std::auto_ptr<_Tp>::auto_ptr(std::auto_ptr_ref<_Tp>) [with _Tp = BackupProtocolMessage]
      [ERROR   ] /usr/lib/gcc/x86_64-redhat-linux/4.1.2/../../../../include/c++/4.1.2/memory:199: note:                 std::auto_ptr<_Tp>::auto_ptr(std::auto_ptr<_Tp>&) [with _Tp = BackupProtocolMessage]
      [ERROR   ] /usr/lib/gcc/x86_64-redhat-linux/4.1.2/../../../../include/c++/4.1.2/memory:190: note:                 std::auto_ptr<_Tp>::auto_ptr(_Tp*) [with _Tp = BackupProtocolMessage]
      [ERROR   ] BackupCommands.cpp:958: error: expected primary-expression before ‘(’ token
      [ERROR   ] BackupCommands.cpp:958: error: expected type-specifier before ‘BackupProtocolIsAlive’
      [ERROR   ] BackupCommands.cpp:958: error: expected `)' before ‘BackupProtocolIsAlive’
      [ERROR   ] make[2]: *** [../../release/lib/backupstore/BackupCommands.o] Error 1
      [INFO    ] make[2]: Leaving directory `lib/backupstore'
      [ERROR   ] make[1]: *** [dep_modules] Error 2
      [INFO    ] make[1]: Leaving directory `bin/bbackupd'
      [ERROR   ] make: *** [release/bin/bbackupd/bbackupd] Error 2
      [INFO    ] ==> Client build complete

--
Build URL: <https://www.boxbackup.org/trac/build/Trunk/1905>
Box Backup <http://www.boxbackup.org/>
An open source, completely automatic on-line backup system for UNIX.



More information about the Boxbackup-commit mailing list