[Box Backup] SV: boxbackup digest, Vol 1 #431 - 5 msgs

Ben Summers boxbackup at fluffy.co.uk
Tue Nov 8 21:12:02 GMT 2005

On 8 Nov 2005, at 16:29, Micael Roxenhall wrote:

> Micael>Thanks!
> Micael>Now that working (strange? I tried all options I think :-))
> Micael>But I still get Error when I running "make Test" as follow:
> Micael>common:PASSED
> Micael>crypto:PASSED
> Micael>compress:PASSED
> Micael>basicserver:PASSED
> Micael>raidfile:PASSED
> Micael>backupstore:FAILED:3tests failed
> Micael>backupstorefix:FAILED:Exception caught: backupstore
> CouldNotFindEntryDirectory
> Micael>backupstorepatch:FAILED:2tests failed
> Micael>backupdiff:PASSED
> Micael>bbackupd:FAILED:2 tests faild
> Micael>What's more can be wrong?

You may wish to tell us a bit more about which platform you're  
running it on. But try again, and see what the result it. It may be  
that there's a timing issue.

Insert my usual comments about tests being a compromise between  
running quickly and always working by having longer pauses to take  
account that it's a lazy daemon which does stuff in it's own sweet time.

Archives, people, archives!


More information about the Boxbackup mailing list